{"text_format":"1","workbook":"xlsx","n_sheets":4,"sheets":["Form","Balance","Tables","Data"],"not_rendered":{"charts":0,"images":1,"macros":1,"external_links":0,"defined_names":262,"comments":1,"pivot_tables":0},"unopened":[],"bounds":{"document_bytes":16777216,"sheet_cells":100000,"rows_first":2000,"rows_last":500,"rows_between":2000,"halvings":0,"cell_chars":16384,"cell_head_chars":4096},"cells_cut":0,"cells_raw":0,"read":"whole","date_system":"1900"}

{"sheet":"Form","index":0,"n_rows":26,"n_cols":16,"rows_kept":26,"cut":false,"hidden":false,"merged":[[3,1,3,7],[3,9,3,12],[2,6,2,7],[2,1,2,5],[28,12,28,13],[25,12,25,13],[27,12,27,13],[26,12,26,13],[2,13,2,14],[3,13,3,14],[13,14,13,15],[17,13,18,15],[2,9,2,12],[6,14,6,15],[5,14,5,15]]}
[null,{"$f":"IF(AND(TIGMODEL>\"\",TIG=\"\"),\"TIG with 4mm glass ONLY (Special order, contact CS)\",IF(AND(TIGMODEL>\"\",TIGBAL=1),\"TIG is NOT Available\",IF(TIG_NOTE>\"\",TIG_NOTE,\"\")))","v":""}]
[null,{"$f":"IF(AND(WSIZE>0,HSIZE>0),\"Only Available At\"&\"  \"&WSIZE&\" x \"&HSIZE&IF(HCONTROL=1,\" or \"&HSIZE2,\"\"),\"\")","v":""},null,null,null,null,null,"Select Model",null,{"$f":"IF(ISERROR(SHATERROR),\"\",IF(SHATERROR=1,\"Adjust CMR to Increase Egress Height\",\"\"))","v":""}]
[null,{"$f":"IF(Model_Select=\"Select Model\",\"\",\"(Model\"&\" \"&ModelNo&\")\")","v":""},null,null,null,null,"Select Model",null,null,{"$f":"\"Min. W:\"&\" \"&MINW","v":"Min. W: 0"},null,null,null,{"$f":"\"Max W:\"&\" \"&MAXW","v":"Max W: 0"}]
[null,{"$f":"Description","v":0},null,null,null,null,null,null,null,{"$f":"\"Min. H:\"&\" \"&MINH","v":"Min. H: 0"},null,null,null,{"$f":"\"Max H:\"&\" \"&MAXH","v":"Max H: 0"},null,{"$f":"\"Max UI:\"&\" \"&MAXUI","v":"Max UI: 0"}]
[null,{"$f":"IF(AND(W>0,H>0),(IF(ISERROR(VLOOKUP(1,Data!$A:$D,3,FALSE)),\"\",VLOOKUP(1,Data!$A:$D,3,FALSE))),\"\")","v":""},null,null,null,{"$f":"IF(SHAT_MIN_R=1,SHAT_MESSAGE,\"\")","v":""},null,{"$f":"IF(AND(W>0,H>0),(IF(ISERROR(VLOOKUP(1,Data!$A:$D,4,FALSE)),\"\",VLOOKUP(1,Data!$A:$D,4,FALSE))),\"\")","v":""},null,null,null,null,null,"Exact Size"]
[null,{"$f":"IF(AND(W>0,H>0),(IF(ISERROR(VLOOKUP(2,Data!$A:$D,3,FALSE)),\"\",VLOOKUP(2,Data!$A:$D,3,FALSE))),\"\")","v":""},null,null,null,null,null,{"$f":"IF(AND(W>0,H>0),(IF(ISERROR(VLOOKUP(2,Data!$A:$D,4,FALSE)),\"\",VLOOKUP(2,Data!$A:$D,4,FALSE))),\"\")","v":""},null,"Width:",null,null,null,{"$f":"IF(AND(RO=2,W>0),W-WCUTBACK,W)","v":0},{"$f":"IF(AND(W>0,WSIZE>0,W<>WSIZE),\"<< Width Not Available\",\"\")","v":""}]
[null,{"$f":"IF(AND(W>0,H>0),(IF(ISERROR(VLOOKUP(3,Data!$A:$D,3,FALSE)),\"\",VLOOKUP(3,Data!$A:$D,3,FALSE))),\"\")","v":""},null,null,null,null,null,{"$f":"IF(AND(W>0,H>0),(IF(ISERROR(VLOOKUP(3,Data!$A:$D,4,FALSE)),\"\",VLOOKUP(3,Data!$A:$D,4,FALSE))),\"\")","v":""},null,"Height:",null,null,null,{"$f":"IF(AND(RO=2,H>0),H-HCUTBACK,H)","v":0},{"$f":"IF(AND(H>0,HSIZE>0,HSIZE2>0,H<>HSIZE,H<>HSIZE2),\"<< Height Not Available\",\"\")","v":""}]
[null,{"$f":"IF(AND(W>0,H>0),(IF(ISERROR(VLOOKUP(4,Data!$A:$D,3,FALSE)),\"\",VLOOKUP(4,Data!$A:$D,3,FALSE))),\"\")","v":""},null,null,null,null,null,{"$f":"IF(AND(W>0,H>0),(IF(ISERROR(VLOOKUP(4,Data!$A:$D,4,FALSE)),\"\",VLOOKUP(4,Data!$A:$D,4,FALSE))),\"\")","v":""},null,{"$f":"IF(OR(ModelNo=\"S140\",ModelNo=\"S144\",ModelNo=\"S146\",ModelNo=\"S140 (HP)\",ModelNo=\"S144 (HP)\",ModelNo=\"S146 (HP)\"),\"Leg:\",\"\")","v":""},null,null,null,{"$f":"LEG_MESSAGE","v":""}]
{"$rows_left_out":19}
{"sheet":"Balance","index":1,"n_rows":271,"n_cols":53,"rows_kept":271,"cut":false,"hidden":true,"merged":[[31,47,31,48],[31,50,31,51],[0,14,0,18],[1,12,1,15],[1,17,1,20],[1,29,1,32],[2,24,2,26],[1,34,1,37],[0,29,0,37]]}
[null,null,null,null,null,null,null,null,null,null,null,null,null,null,"BLOCK & TACKLE BALANCE CHART",null,null,null,null,null,null,null,null,null,null,null,null,null,null,"V-Series BLOCK & TACKLE BALANCE CHART"]
[null,null,null,null,null,null,null,null,null,null,null,null,"TOP SASH",null,null,null,null,"BOTTOM SASH",null,null,null,null,null,null,null,null,null,null,null,"TOP SASH",null,null,null,null,"BOTTOM SASH"]
[null,"0100, 0700, 01HP, 07HP","Length","Weight/ft","Weight",null,"8001","Length","Weight/ft","Weight",null,null,"Sash Weight","Tube Length","Balance","Weight",null,"Sash Weight","Tube Length","Balance","Weight",null,null,null,"Tube Length",null,null,null,null,"Sash Weight","Tube Length","Balance","Weight",null,"Sash Weight","Tube Length","Balance","Weight",null,null,null,null,"Caldwell Balance Chart"]
[null,"Bottom Top Rail",{"$f":"(Frame_Width-2.3125)/12","v":-0.19270833333333334},0.24099999999999999,{"$f":"C4*D4","v":-4.6442708333333332E-2},null,"Top Top Rail",{"$f":"BSW/12","v":0},0.34100000000000003,{"$f":"H4*I4","v":0},null,null,{"$f":"TRUNC(TOP_WGT+GRID)","v":0},{"$f":"$M$9","v":0},"Number","Range",null,{"$f":"TRUNC(BTM_WGT+GRID)","v":0},{"$f":"$R$9","v":0},"Number","Range",null,null,null,"Model","Top","Bott",null,null,{"$f":"TRUNC(TOP_WGT)","v":0},{"$f":"TOPTUBELENGTH","v":0},"Number","Range",null,{"$f":"TRUNC(BTM_WGT)","v":0},{"$f":"BOTTUBELENGTH","v":0},"Number","Range",null,null,null,null,{"$f":"IF(OR(ModelNo=\"1700\",ModelNo=\"1720\",ModelNo=\"1730\"),1,IF(OR(ModelNo=\"1900\",ModelNo=\"1920\",ModelNo=\"1930\"),2,3))","v":3},{"$f":"IF(OR(ModelNo=\"1700\",ModelNo=\"1720\",ModelNo=\"1730\"),4,IF(OR(ModelNo=\"1900\",ModelNo=\"1920\",ModelNo=\"1930\"),5,6))","v":6},"Bott.","Top",null,1,4,2,5,3,6]
[null,"Bottom Bottom Rail",{"$f":"(Frame_Width-2.3125)/12","v":-0.19270833333333334},0.25,-4.8177083333333336E-2,null,"Top Bottom Rail",{"$f":"BSW/12","v":0},0.38400000000000001,0,null,null,"Balance Size",{"$f":"IF(AND(O5>0,P5>0),O5,0)","v":0},{"$f":"IF($N$4<=6,6,0)","v":6},{"$f":"IF(AND(O5=6,$M$4>=2,$M$4<=5),O5&\"A\",0)","v":0},null,"Balance Size",{"$f":"IF(AND(T5>0,U5>0),T5,0)","v":0},{"$f":"IF($S$4<=6,6,0)","v":6},{"$f":"IF(AND(T5=6,$R$4>=2,$R$4<=5),T5&\"A\",0)","v":0},null,null,null,"S140",null,{"$f":"(INT(INT(Frame_Height/2-0.25)/2)+0.5)*2","v":-1},null,null,"Balance Size",{"$f":"IF(AND(AF5>0,AG5>0),AF5,0)","v":0},{"$f":"IF($AE$4<=8,8,0)","v":8},{"$f":"IF(AND(AF5=8,$AD$4>=2,$AD$4<=6),AF5&\"A\",0)","v":0},null,"Balance Size",{"$f":"IF(AND(AK5>0,AL5>0),AK5,0)","v":0},{"$f":"IF($AJ$4<=8,8,0)","v":8},{"$f":"IF(AND(AK5=8,$AI$4>=2,$AI$4<=6),AK5&\"A\",0)","v":0},null,null,null,null,{"$f":"HLOOKUP($AQ$4,CALDWELL_LOOKUP,2,FALSE)","v":9},{"$f":"HLOOKUP($AR$4,CALDWELL_LOOKUP,2,FALSE)","v":9.9994999999999994},8,7,null,9.7665000000000006,10.766,9.2185000000000006,10.218,9,9.9994999999999994]
[null,"Bottom Stile",{"$f":"((CDIM_0100+0.125)*2)/12","v":2.0833333333333332E-2},0.23,4.7916666666666663E-3,null,"Top Stile",{"$f":"(BSH*2)/12","v":0},0.311,0,null,null,{"$f":"VLOOKUP((MAX(N5:N271)),N5:P271,3,FALSE)","v":0},0,6,{"$f":"IF(AND(O6=6,$M$4>=6,$M$4<=9),O6&\"B\",0)","v":0},null,{"$f":"VLOOKUP((MAX(S5:S271)),S5:U271,3,FALSE)","v":0},0,6,{"$f":"IF(AND(T6=6,$R$4>=6,$R$4<=9),T6&\"B\",0)","v":0},null,null,null,"S144",null,{"$f":"(INT(INT(Frame_Height/2-0.25)/2)+0.5)*2","v":-1},null,null,{"$f":"VLOOKUP((MAX(AE5:AE229)),AE5:AG229,3,FALSE)","v":0},0,{"$f":"IF($AE$4<=8,8,0)","v":8},{"$f":"IF(AND(AF6=8,$AD$4>=7,$AD$4<=10),AF6&\"B\",0)","v":0},null,{"$f":"VLOOKUP((MAX(AJ5:AJ229)),AJ5:AL229,3,FALSE)","v":0},0,{"$f":"IF($AJ$4<=8,8,0)","v":8},{"$f":"IF(AND(AK6=8,$AI$4>=7,$AI$4<=10),AK6&\"B\",0)","v":0},null,null,null,null,{"$f":"HLOOKUP($AQ$4,CALDWELL_LOOKUP,3,FALSE)","v":10},{"$f":"HLOOKUP($AR$4,CALDWELL_LOOKUP,3,FALSE)","v":10.999499999999999},9,8,null,10.766500000000001,11.766,10.218500000000001,11.218,10,10.999499999999999]
[null,"Bottom Rail Reinf.",{"$f":"(TRUNC(((C4*12)-6)/2)*2)/12","v":-0.66666666666666663},0.32800000000000001,-0.21866666666666668,null,"Top Stile Reinf.",0,0,0,null,null,null,0,6,{"$f":"IF(AND(O7=6,$M$4>=10,$M$4<=12),O7&\"C\",0)","v":0},null,null,0,6,{"$f":"IF(AND(T7=6,$R$4>=10,$R$4<=12),T7&\"C\",0)","v":0},null,null,null,"S146",null,{"$f":"(INT(INT(Frame_Height/2-0.25)/2)+0.5)*2","v":-1},null,null,null,0,{"$f":"IF($AE$4<=8,8,0)","v":8},{"$f":"IF(AND(AF7=8,$AD$4>=11,$AD$4<=13),AF7&\"C\",0)","v":0},null,null,0,{"$f":"IF($AJ$4<=8,8,0)","v":8},{"$f":"IF(AND(AK7=8,$AI$4>=11,$AI$4<=13),AK7&\"C\",0)","v":0},null,null,null,null,{"$f":"HLOOKUP($AQ$4,CALDWELL_LOOKUP,4,FALSE)","v":11},{"$f":"HLOOKUP($AR$4,CALDWELL_LOOKUP,4,FALSE)","v":12.999499999999999},10,9,null,11.766500000000001,13.766,11.218500000000001,13.218,11,12.999499999999999]
[null,"Bottom Stile Reinf.",0,0.23799999999999999,0,null,"Keeper Bead",{"$f":"(BSW-1.197)/12","v":-9.9750000000000005E-2},9.7000000000000003E-2,{"$f":"H8*I8","v":-9.6757500000000003E-3},null,null,"Top Tube length",0,6,{"$f":"IF(AND(O8=6,$M$4>=13,$M$4<=15),O8&\"D\",0)","v":0},null,"Bott. Tube Length",0,6,{"$f":"IF(AND(T8=6,$R$4>=13,$R$4<=15),T8&\"D\",0)","v":0},null,null,null,"R601",{"$f":"IF(DDIM_8001>=Frame_Height/2-0.07,(INT(INT((Frame_Height/2-4.75)+0.25)/2))*2,(INT(INT((DDIM_8001-4.75)+0.25)/2))*2)","v":{"$error":"#REF!"}},{"$f":"(INT(INT((Frame_Height/2-2.75)+0.25)/2)*2)","v":-4},null,null,null,0,{"$f":"IF(AND($AE$4<=10,$AE$4>8),10,0)","v":0},{"$f":"IF(AND(AF8=10,$AD$4>=2,$AD$4<=6),AF8&\"A\",0)","v":0},null,null,0,{"$f":"IF(AND($AJ$4<=10,$AJ$4>8),10,0)","v":0},{"$f":"IF(AND(AK8=10,$AI$4>=2,$AI$4<=6),AK8&\"A\",0)","v":0},null,null,null,null,{"$f":"HLOOKUP($AQ$4,CALDWELL_LOOKUP,5,FALSE)","v":13},{"$f":"HLOOKUP($AR$4,CALDWELL_LOOKUP,5,FALSE)","v":14.999499999999999},12,10,null,13.766500000000002,15.766000000000002,13.218500000000002,15.218000000000002,13,14.999499999999999]
{"$rows_left_out":264}
{"sheet":"Tables","index":2,"n_rows":142,"n_cols":40,"rows_kept":142,"cut":false,"hidden":true,"merged":[[1,32,1,34],[14,15,14,20]]}
[null,"S140 / S144 / S146 Calculations"]
[null,"Frame Cut Leg",{"$f":"LEG+6","v":6},null,null,1,"SashW","SashH","GlassW","GlassH","Radius","Weight",null,null,{"$f":"IF(OR(ModelNo=\"1700\",ModelNo=\"1720\",ModelNo=\"1730\",ModelNo=\"1900\",ModelNo=\"1920\",ModelNo=\"1930\",ModelNo=\"1901\",ModelNo=\"1921\",ModelNo=\"1931\"),1,0)","v":0},"1700","1720","1730","1900","1920","1930","1901","1921","1931",null,null,null,null,null,"Glass Strength",null,null,"CFB"]
[null,"CMRD",{"$f":"Frame_Height-C2","v":-6},null,"Mezzo",2,{"$f":"Frame_Width-3.125","v":-3.125},{"$f":"CDIM_S140-1.125","v":-1.125},{"$f":"G3-1.6875","v":-4.8125},{"$f":"H3-1.625","v":-2.75},12.5,{"$f":"BWGT_03A0","v":{"$error":"#VALUE!"}},null,null,"TGW",{"$f":"IF(TGW_1700>40.5,1,0)","v":0},{"$f":"IF(TGW_1720>40.25,1,0)","v":0},{"$f":"IF(TGW_1730>25.5,1,0)","v":0},{"$f":"IF(TGW_1900>40.5,1,0)","v":0},{"$f":"IF(TGW_1920>40.25,1,0)","v":0},{"$f":"IF(TGW_1930>25.5,1,0)","v":0},{"$f":"IF(TGW_1901>39.25,1,0)","v":0},{"$f":"IF(TGW_1921>39,1,0)","v":0},{"$f":"IF(TGW_1931>30.9375,1,0)","v":0},null,null,1,{"$f":"IF(AD3>\"\",VLOOKUP(AD3,GLASSLOOKUP,2,FALSE),\"\")","v":""},{"$f":"IF(AD3>\"\",VLOOKUP(AB3,WEIGHTCHART,2,FALSE),\"\")","v":""},{"$f":"GLASS1","v":""},null,{"$f":"VLOOKUP(BTM_WGT,CFB_W,3,FALSE)","v":{"$error":"#N/A"}},4,3,"BN",null,null,"Extrusion"]
[null,"Sash Cut back",{"$f":"IF(OR(EXTSELECT=2,EXTSELECT=3),3.125,IF(OR(EXTSELECT=4,EXTSELECT=5),2.3125,IF(EXTSELECT=6,2.25,0)))","v":0},null,"Mezzo",3,{"$f":"Frame_Width-3.125","v":-3.125},{"$f":"CDIM_S140-1.125","v":-1.125},{"$f":"G4-1.6875","v":-4.8125},{"$f":"H4-1.625","v":-2.75},13,{"$f":"BWGT_03A0","v":{"$error":"#VALUE!"}},null,null,"TGH",{"$f":"IF(TGH_1700>35.34375,1,0)","v":0},{"$f":"IF(TGH_1720>35.34375,1,0)","v":0},{"$f":"IF(TGH_1730>35.34375,1,0)","v":0},{"$f":"IF(TGH_1900>35.34375,1,0)","v":0},{"$f":"IF(TGH_1920>35.34375,1,0)","v":0},{"$f":"IF(TGH_1930>35.34375,1,0)","v":0},{"$f":"IF(TGH_1901>35.1875,1,0)","v":0},{"$f":"IF(TGH_1921>35.1875,1,0)","v":0},{"$f":"IF(TGH_1931>35.1875,1,0)","v":0},null,null,2,"","",{"$f":"GLASS2","v":""},null,null,{"$f":"AG3+1","v":5},3,"BN",null,1,{"$f":"IF(EXT_1=0,\"\",EXT_1)","v":""},0,0]
[null,"F",{"$f":"2*(ASIN((EXT*2)/(2*C11)))","v":{"$error":"#DIV/0!"}},null,"0700",4,{"$f":"Frame_Width-2.3125","v":-2.3125},{"$f":"CDIM_S140+0.125","v":0.125},{"$f":"Frame_Width-4","v":-4},{"$f":"CDIM_S140-1.5625","v":-1.5625},10,{"$f":"BWGT_0100","v":{"$error":"#VALUE!"}},null,null,"BGW",{"$f":"IF(BGW_1700>40.5,1,0)","v":0},{"$f":"IF(BGW_1720>40.25,1,0)","v":0},{"$f":"IF(BGW_1730>25.46875,1,0)","v":0},{"$f":"IF(BGW_1900>40.5,1,0)","v":0},{"$f":"IF(BGW_1920>40.25,1,0)","v":0},{"$f":"IF(BGW_1930>25.5,1,0)","v":0},{"$f":"IF(BGW_1901>40.5,1,0)","v":0},{"$f":"IF(BGW_1921>40.25,1,0)","v":0},{"$f":"IF(BGW_1931>32.1875,1,0)","v":0},null,null,3,"","",{"$f":"GLASS3","v":""},null,null,6,3,"BN",null,2,{"$f":"IF(EXT_2=0,\"\",EXT_2)","v":""},2.40625,12.5]
[null,"d",{"$f":"C11*COS(C5/2)","v":{"$error":"#DIV/0!"}},null,"Fusion",5,{"$f":"Frame_Width-2.25","v":-2.25},{"$f":"CDIM_S140-0.75","v":-0.75},{"$f":"Frame_Width-3.9375","v":-3.9375},{"$f":"CDIM_S140-2.4375","v":-2.4375},11.75,{"$f":"BWGT_02A0","v":{"$error":"#VALUE!"}},null,null,"BGH",{"$f":"IF(BGH_1700>35.34375,1,0)","v":0},{"$f":"IF(BGH_1720>35.34375,1,0)","v":0},{"$f":"IF(BGH_1730>35.34375,1,0)","v":0},{"$f":"IF(BGH_1900>35.3125,1,0)","v":0},{"$f":"IF(BGH_1920>35.34375,1,0)","v":0},{"$f":"IF(BGH_1930>35.3125,1,0)","v":0},{"$f":"IF(BGH_1901>35.1875,1,0)","v":0},{"$f":"IF(BGH_1921>35.1875,1,0)","v":0},{"$f":"IF(BGH_1931>35.1875,1,0)","v":0},null,null,4,"","",{"$f":"GLASS4","v":""},null,null,7,4,"RD",null,3,{"$f":"IF(EXT_3=0,\"\",EXT_3)","v":""},2.40625,13]
[null,"h",{"$f":"C11-C6","v":{"$error":"#DIV/0!"}},null,1700,6,{"$f":"Frame_Width-2.1875","v":-2.1875},{"$f":"CDIM_S140-0.84375","v":-0.84375},{"$f":"G7-1.3125","v":-3.5},{"$f":"H7-1.3125","v":-2.15625},12,{"$f":"Balance!E40","v":{"$error":"#VALUE!"}},null,null,null,{"$f":"MAX(P3:P6)","v":0},0,0,0,0,0,0,0,0,null,null,5,"","",{"$f":"GLASS5","v":""},null,null,8,4,"RD",null,4,{"$f":"IF(EXT_5=0,\"\",EXT_5)","v":""},1,10]
[null,null,{"$f":"IF(ModelNo=\"S146\",((Frame_Height-LEG)/2)+(((Frame_Width*2)^2)/(8*(Frame_Height-LEG))),((Frame_Height-LEG)/2)+((Frame_Width^2)/(8*(Frame_Height-LEG))))","v":{"$error":"#DIV/0!"}},null,1900,7,{"$f":"Frame_Width-2.1875","v":-2.1875},{"$f":"CDIM_S140-1.03125","v":-1.03125},{"$f":"G8-1.3125","v":-3.5},{"$f":"H8-1.3125","v":-2.34375},12,{"$f":"Balance!E52","v":{"$error":"#VALUE!"}},null,"Stile Reinf. Driver >>",{"$f":"MAX(P8:X8,O9,O10)","v":0},{"$f":"IF(ModelNo=\"1700\",HLOOKUP(Model_Select,REINF_CHART,6,FALSE),0)","v":0},{"$f":"IF(ModelNo=\"1720\",HLOOKUP(Model_Select,REINF_CHART,6,FALSE),0)","v":0},{"$f":"IF(ModelNo=\"1730\",HLOOKUP(Model_Select,REINF_CHART,6,FALSE),0)","v":0},{"$f":"IF(ModelNo=\"1900\",HLOOKUP(Model_Select,REINF_CHART,6,FALSE),0)","v":0},{"$f":"IF(ModelNo=\"1920\",HLOOKUP(Model_Select,REINF_CHART,6,FALSE),0)","v":0},{"$f":"IF(ModelNo=\"1930\",HLOOKUP(Model_Select,REINF_CHART,6,FALSE),0)","v":0},{"$f":"IF(ModelNo=\"1901\",HLOOKUP(Model_Select,REINF_CHART,6,FALSE),0)","v":0},{"$f":"IF(ModelNo=\"1921\",HLOOKUP(Model_Select,REINF_CHART,6,FALSE),0)","v":0},{"$f":"IF(ModelNo=\"1931\",HLOOKUP(Model_Select,REINF_CHART,6,FALSE),0)","v":0},null,null,6,"","",{"$f":"GLASS6","v":""},null,null,9,5,"BU",null,5,{"$f":"IF(EXT_4=0,\"\",EXT_6)","v":""},1.75,11.75]
{"$rows_left_out":135}
{"sheet":"Data","index":3,"n_rows":630,"n_cols":81,"rows_kept":630,"cut":false,"hidden":true,"merged":[]}
[null,"Model","Description","Value"]
[{"$f":"IF(OR(ModelNo=\"0151\",ModelNo=\"0951\",ModelNo=\"9051\",ModelNo=\"8051\"),1,\"\")","v":""},"0151","Sash Width",{"$f":"Frame_Width-1.625","v":-1.625},null,{"$f":"Model_Select","v":"Select Model"},"Models","Description","W cut-back","H-cut-back","Width","Height","Min W","Min H","Max W","Max H","Max UI","Type1","Type2","Type3","Type4","Screen1","Screen2","Screen3","Ext./Reinf.","Ext./Reinf.","Ext./Reinf.","Ext./Reinf.","Ext./Reinf.","Ext./Reinf.","Ext./Reinf.","Ext./Reinf.","Glass1","Glass2","Glass3","Glass4","Glass5","Glass6","Glass7","Glass8","Opening","CDIM","DDIM","TSW","TSH","TGW","TGH","TGSF","BSW","BSH","BGW","BGH","BGSF","Bott. Sash Weight","Top Sash Weight","Bot. of Coil From CMR","Head + 4.5","Sill + CMR","EW","EH",null,null,null,null,null,null,null,null,"Triple IG calculation",null,null,null,null,null,null,null,"S140 Limitations"]
[{"$f":"IF(OR(ModelNo=\"0151\",ModelNo=\"0951\",ModelNo=\"9051\",ModelNo=\"8051\"),2,\"\")","v":""},"0151","Sash Height",{"$f":"Frame_Height-1.625","v":-1.625},null,1,"Select Model"]
[{"$f":"IF(OR(ModelNo=\"0151\",ModelNo=\"0951\",ModelNo=\"9051\",ModelNo=\"8051\"),3,\"\")","v":""},"0151","Sash Glass Width",{"$f":"Frame_Width-4.625","v":-4.625},null,2,"3001","4000 Series Double Hung",0,0,null,null,12,20,{"$f":"IF(EXTSELECT=2,48,IF(EXTSELECT=3,52,\"\"))","v":""},{"$f":"IF(EXTSELECT=2,84,IF(EXTSELECT=3,96,\"\"))","v":""},{"$f":"IF(EXTSELECT=2,126,IF(EXTSELECT=3,148,\"\"))","v":""},"Standard","Custom",null,null,"Half","Full","Locking","Select Reinforcement","Composite","Steel",null,null,null,null,null,null,"Double Strength (3 mm)","Triple Strength (5 mm)","Triple IG Single Strength","Triple IG Double Strength","Laminated",null,null,{"$f":"IF(RO=2,\"<< Exact Size Only\",\"\")","v":""},{"$f":"Frame_Height-AQ4","v":0},{"$f":"IF(TYPE=1,(Frame_Height/2),IF(TYPE=2,CMR))","v":0},{"$f":"Frame_Width-4.125","v":-4.125},{"$f":"DDIM_3001-1.625","v":-1.625},{"$f":"TRUNC((Frame_Width-5.8125)*16+0.5)/16","v":-5.75},{"$f":"TRUNC((DDIM_3001-3.25)*32+0.5)/32","v":-3.21875},{"$f":"(AT4*AU4)/144","v":0.12852647569444445},{"$f":"Frame_Width-3.125","v":-3.125},{"$f":"CDIM_3001-0.625","v":-0.625},{"$f":"TRUNC((Frame_Width-4.8125)*16+0.5)/16","v":-4.75},{"$f":"TRUNC((CDIM_3001-2.25)*32+0.5)/32","v":-2.21875},{"$f":"(AY4*AZ4)/144","v":7.3187934027777776E-2},{"$f":"BWGT_3001","v":{"$error":"#VALUE!"}},{"$f":"TWGT_3001","v":{"$error":"#VALUE!"}},{"$f":"IF(COIL=1,3.875-0.6875,3.875+((COIL-1)*1.625)-0.6875)","v":{"$error":"#N/A"}},6,1.875,{"$f":"Frame_Width-5.25","v":-5.25},{"$f":"IF(AND(AX4>36.0625,(Frame_Height/2)<=CMR),CDIM_3001-BF4-BD4-0.125,IF(OR(AND(AX4>36.0625,(Frame_Height/2)<=CMR),(Frame_Height/2)>=CMR),Frame_Height-AX4-BE4-BF4,CDIM_3001-BF4-BD4-0.125))","v":-7.25},null,null,null,1,"Single Strength (2.5 mm)",null,null,null,"SS (2.2)","DS (3.2)","4 mm","TS (5.0)",null,null,null,null,"Min. W","Min. H","Max. W","Max. H","Max. UI"]
[{"$f":"IF(OR(ModelNo=\"0151\",ModelNo=\"0951\",ModelNo=\"9051\",ModelNo=\"8051\"),4,\"\")","v":""},"0151","Sash Glass Height",{"$f":"Frame_Height-4.625","v":-4.625},null,3,"3002","4000 Series Two Lite Slider",0,0,null,null,18.5,11.25,{"$f":"IF(EXTSELECT=2,72,IF(EXTSELECT=3,96,\"\"))","v":""},{"$f":"IF(EXTSELECT=2,56,IF(EXTSELECT=3,72,\"\"))","v":""},{"$f":"IF(EXTSELECT=2,128,IF(EXTSELECT=3,156,\"\"))","v":""},"Standard",null,null,null,"Half","Full",null,"Select Reinforcement","Composite","Steel",null,null,null,null,null,null,"Double Strength (3 mm)","Triple Strength (5 mm)","Triple IG Single Strength","Triple IG Double Strength","Laminated",null,null,"",null,null,null,null,null,null,null,null,null,null,null,null,null,null,null,null,null,{"$f":"(Frame_Width/2)-4.75","v":-4.75},null,null,null,null,2,"Double Strength (3 mm)",null,null,"Max. Short",{"$f":"IF(TG2W>41,0,41)","v":41},{"$f":"IF(TG2W>56,0,56)","v":56},{"$f":"IF(TG2W>67,0,67)","v":67},{"$f":"IF(TG2W>70,0,70)","v":70},"Annealed",null,null,"Mezzo",25,40]
[{"$f":"IF(OR(ModelNo=\"0151\",ModelNo=\"0951\",ModelNo=\"9051\",ModelNo=\"8051\"),5,\"\")","v":""},"0151","Glass Area (sq.ft.)",{"$f":"(D4*D5)/144","v":0.14854600694444445},null,4,"3003","4000 Series Three Lite Slider (1/4-1/2-1/4)",0,0,null,null,47.5,11.25,{"$f":"IF(EXTSELECT=2,108,IF(EXTSELECT=3,120,\"\"))","v":""},{"$f":"IF(EXTSELECT=2,56,IF(EXTSELECT=3,72,\"\"))","v":""},{"$f":"IF(EXTSELECT=2,164,IF(EXTSELECT=3,192,\"\"))","v":""},"Standard (1/4-1/2-1/4)",null,null,null,"Half","Full",null,"Select Reinforcement","Composite","Steel",null,null,null,null,null,null,"Double Strength (3 mm)","Triple Strength (5 mm)","Triple IG Single Strength","Triple IG Double Strength","Laminated",null,null,"",null,null,null,null,null,null,null,null,null,null,null,null,null,null,null,null,null,{"$f":"(Frame_Width/4)-2.25","v":-2.25},null,null,null,null,3,"Triple Strength (5 mm)",null,null,"Max. Long",{"$f":"IF(TG2H>62,0,62)","v":62},{"$f":"IF(TG2H>76,0,76)","v":76},{"$f":"IF(TG2H>90,0,90)","v":90},{"$f":"IF(TG2H>102,0,102)","v":102},"Annealed",null,null,"Mezzo/N.F",26,41]
[{"$f":"IF(OR(ModelNo=\"0151\",ModelNo=\"0951\",ModelNo=\"9051\",ModelNo=\"8051\"),6,\"\")","v":""},"0151","Screen Width",{"$f":"Frame_Width-4","v":-4},null,5,"3004","4000 Series Picture Window",0,0,null,null,9.5,9.5,112,112,154,"Standard",null,null,null,null,null,null,null,null,null,null,null,null,null,null,null,"Double Strength (3 mm)","Triple Strength (5 mm)","Triple IG Single Strength","Triple IG Double Strength","Laminated",null,null,"",null,null,null,null,null,null,null,null,null,null,null,null,null,null,null,null,null,null,null,null,null,null,4,"Triple IG Single Strrength",null,null,"Max Sq.Ft.",{"$f":"IF(TG2A>12,0,12)","v":12},{"$f":"IF(TG2A>22,0,22)","v":22},{"$f":"IF(TG2A>32,0,32)","v":32},{"$f":"IF(TG2A>35,0,35)","v":35},"Annealed",null,null,"New Construction",20,36]
[{"$f":"IF(OR(ModelNo=\"0151\",ModelNo=\"0951\",ModelNo=\"9051\",ModelNo=\"8051\"),7,\"\")","v":""},"0151","Screen Height",{"$f":"Frame_Height-4","v":-4},null,6,"3009","4000 Series Three Lite Slider Equal Lite",0,0,null,null,37.25,11.25,{"$f":"IF(EXTSELECT=2,108,IF(EXTSELECT=3,120,\"\"))","v":""},{"$f":"IF(EXTSELECT=2,56,IF(EXTSELECT=3,72,\"\"))","v":""},{"$f":"IF(EXTSELECT=2,164,IF(EXTSELECT=3,192,\"\"))","v":""},"Standard (1/3-1/3-1/3)",null,null,null,"Half","Full",null,"Select Reinforcement","Composite","Steel",null,null,null,null,null,null,"Double Strength (3 mm)","Triple Strength (5 mm)","Triple IG Single Strength","Triple IG Double Strength","Laminated",null,null,"",null,null,null,null,null,null,null,null,null,null,null,null,null,null,null,null,null,{"$f":"(Frame_Width/3)-4.375","v":-4.375},null,null,null,null,5,"Triple IG Double Strength",null,null,"Max. Short",0,{"$f":"IF(TG2W>42,0,42)","v":42},{"$f":"IF(TG2W>70,0,70)","v":70},{"$f":"IF(TG2W>70,0,70)","v":70},"Tempered",null,null,"0700 Series",20,36]
{"$rows_left_out":622}