{"text_format":"1","workbook":"xlsx","n_sheets":4,"sheets":["Form","Balance","Tables","Data"],"not_rendered":{"charts":0,"images":1,"macros":1,"external_links":0,"defined_names":262,"comments":1,"pivot_tables":0},"unopened":[],"bounds":{"document_bytes":16777216,"sheet_cells":100000,"rows_first":2000,"rows_last":500,"rows_between":2000,"halvings":0,"cell_chars":16384,"cell_head_chars":4096},"cells_cut":0,"cells_raw":0,"read":"whole","date_system":"1900"}

{"sheet":"Form","index":0,"n_rows":26,"n_cols":16,"rows_kept":26,"cut":false,"hidden":false,"merged":[[3,1,3,7],[3,9,3,12],[2,6,2,7],[2,1,2,5],[28,12,28,13],[25,12,25,13],[27,12,27,13],[26,12,26,13],[2,13,2,14],[3,13,3,14],[13,14,13,15],[17,13,18,15],[2,9,2,12],[6,14,6,15],[5,14,5,15]]}
[null,{"$f":"IF(AND(TIGMODEL>\"\",TIG=\"\"),\"TIG with 4mm glass ONLY (Special order, contact CS)\",IF(AND(TIGMODEL>\"\",TIGBAL=1),\"TIG is NOT Available\",IF(TIG_NOTE>\"\",TIG_NOTE,\"\")))","v":""}]
[null,{"$f":"IF(AND(WSIZE>0,HSIZE>0),\"Only Available At\"&\"  \"&WSIZE&\" x \"&HSIZE&IF(HCONTROL=1,\" or \"&HSIZE2,\"\"),\"\")","v":""},null,null,null,null,null,"Select Model",null,{"$f":"IF(ISERROR(SHATERROR),\"\",IF(SHATERROR=1,\"Adjust CMR to Increase Egress Height\",\"\"))","v":""}]
[null,{"$f":"IF(Model_Select=\"Select Model\",\"\",\"(Model\"&\" \"&ModelNo&\")\")","v":""},null,null,null,null,"Select Model",null,null,{"$f":"\"Min. W:\"&\" \"&MINW","v":"Min. W: 0"},null,null,null,{"$f":"\"Max W:\"&\" \"&MAXW","v":"Max W: 0"}]
[null,{"$f":"Description","v":0},null,null,null,null,null,null,null,{"$f":"\"Min. H:\"&\" \"&MINH","v":"Min. H: 0"},null,null,null,{"$f":"\"Max H:\"&\" \"&MAXH","v":"Max H: 0"},null,{"$f":"\"Max UI:\"&\" \"&MAXUI","v":"Max UI: 0"}]
[null,{"$f":"IF(AND(W>0,H>0),(IF(ISERROR(VLOOKUP(1,Data!$A:$D,3,FALSE)),\"\",VLOOKUP(1,Data!$A:$D,3,FALSE))),\"\")","v":""},null,null,null,{"$f":"IF(SHAT_MIN_R=1,SHAT_MESSAGE,\"\")","v":""},null,{"$f":"IF(AND(W>0,H>0),(IF(ISERROR(VLOOKUP(1,Data!$A:$D,4,FALSE)),\"\",VLOOKUP(1,Data!$A:$D,4,FALSE))),\"\")","v":""},null,null,null,null,null,"Exact Size"]
[null,{"$f":"IF(AND(W>0,H>0),(IF(ISERROR(VLOOKUP(2,Data!$A:$D,3,FALSE)),\"\",VLOOKUP(2,Data!$A:$D,3,FALSE))),\"\")","v":""},null,null,null,null,null,{"$f":"IF(AND(W>0,H>0),(IF(ISERROR(VLOOKUP(2,Data!$A:$D,4,FALSE)),\"\",VLOOKUP(2,Data!$A:$D,4,FALSE))),\"\")","v":""},null,"Width:",null,null,null,{"$f":"IF(AND(RO=2,W>0),W-WCUTBACK,W)","v":0},{"$f":"IF(AND(W>0,WSIZE>0,W<>WSIZE),\"<< Width Not Available\",\"\")","v":""}]
[null,{"$f":"IF(AND(W>0,H>0),(IF(ISERROR(VLOOKUP(3,Data!$A:$D,3,FALSE)),\"\",VLOOKUP(3,Data!$A:$D,3,FALSE))),\"\")","v":""},null,null,null,null,null,{"$f":"IF(AND(W>0,H>0),(IF(ISERROR(VLOOKUP(3,Data!$A:$D,4,FALSE)),\"\",VLOOKUP(3,Data!$A:$D,4,FALSE))),\"\")","v":""},null,"Height:",null,null,null,{"$f":"IF(AND(RO=2,H>0),H-HCUTBACK,H)","v":0},{"$f":"IF(AND(H>0,HSIZE>0,HSIZE2>0,H<>HSIZE,H<>HSIZE2),\"<< Height Not Available\",\"\")","v":""}]
[null,{"$f":"IF(AND(W>0,H>0),(IF(ISERROR(VLOOKUP(4,Data!$A:$D,3,FALSE)),\"\",VLOOKUP(4,Data!$A:$D,3,FALSE))),\"\")","v":""},null,null,null,null,null,{"$f":"IF(AND(W>0,H>0),(IF(ISERROR(VLOOKUP(4,Data!$A:$D,4,FALSE)),\"\",VLOOKUP(4,Data!$A:$D,4,FALSE))),\"\")","v":""},null,{"$f":"IF(OR(ModelNo=\"S140\",ModelNo=\"S144\",ModelNo=\"S146\",ModelNo=\"S140 (HP)\",ModelNo=\"S144 (HP)\",ModelNo=\"S146 (HP)\"),\"Leg:\",\"\")","v":""},null,null,null,{"$f":"LEG_MESSAGE","v":""}]
[null,{"$f":"IF(AND(W>0,H>0),(IF(ISERROR(VLOOKUP(5,Data!$A:$D,3,FALSE)),\"\",VLOOKUP(5,Data!$A:$D,3,FALSE))),\"\")","v":""},null,null,null,null,null,{"$f":"IF(AND(W>0,H>0),(IF(ISERROR(VLOOKUP(5,Data!$A:$D,4,FALSE)),\"\",VLOOKUP(5,Data!$A:$D,4,FALSE))),\"\")","v":""},null,{"$f":"IF(BTYPE=\"Custom\",\"CMR:\",\"\")","v":""},null,null,null,{"$f":"IF(AND(W>0,H>0,BTYPE=\"Custom\"),\"<< CMR, Top Down\",\"\")","v":""}]
[null,{"$f":"IF(AND(W>0,H>0),(IF(ISERROR(VLOOKUP(6,Data!$A:$D,3,FALSE)),\"\",VLOOKUP(6,Data!$A:$D,3,FALSE))),\"\")","v":""},null,null,null,null,null,{"$f":"IF(AND(W>0,H>0),(IF(ISERROR(VLOOKUP(6,Data!$A:$D,4,FALSE)),\"\",VLOOKUP(6,Data!$A:$D,4,FALSE))),\"\")","v":""},null,{"$f":"IF(SELECTEXT=\"Select Extrusion\",\"Ext.\",IF(SELECTEXT=\"Select Reinforcement\",\"Reinforce\",IF(SELECTEXT=\"Standard\",\"HP >>\",\"\")))","v":""},null,null,null,{"$f":"EXT_MESSAGE","v":""}]
[null,{"$f":"IF(AND(W>0,H>0),(IF(ISERROR(VLOOKUP(7,Data!$A:$D,3,FALSE)),\"\",VLOOKUP(7,Data!$A:$D,3,FALSE))),\"\")","v":""},null,null,null,null,null,{"$f":"IF(AND(W>0,H>0),(IF(ISERROR(VLOOKUP(7,Data!$A:$D,4,FALSE)),\"\",VLOOKUP(7,Data!$A:$D,4,FALSE))),\"\")","v":""},null,"Opening:",null,null,null,{"$f":"RO_OPTION","v":0}]
[null,{"$f":"IF(AND(W>0,H>0),(IF(ISERROR(VLOOKUP(8,Data!$A:$D,3,FALSE)),\"\",VLOOKUP(8,Data!$A:$D,3,FALSE))),\"\")","v":""},null,null,null,null,null,{"$f":"IF(AND(W>0,H>0),(IF(ISERROR(VLOOKUP(8,Data!$A:$D,4,FALSE)),\"\",VLOOKUP(8,Data!$A:$D,4,FALSE))),\"\")","v":""},null,"Type:"]
[null,{"$f":"IF(AND(W>0,H>0),(IF(ISERROR(VLOOKUP(9,Data!$A:$D,3,FALSE)),\"\",VLOOKUP(9,Data!$A:$D,3,FALSE))),\"\")","v":""},null,null,null,null,null,{"$f":"IF(AND(W>0,H>0),(IF(ISERROR(VLOOKUP(9,Data!$A:$D,4,FALSE)),\"\",VLOOKUP(9,Data!$A:$D,4,FALSE))),\"\")","v":""},null,"Screen:"]
[null,{"$f":"IF(AND(W>0,H>0),(IF(ISERROR(VLOOKUP(10,Data!$A:$D,3,FALSE)),\"\",VLOOKUP(10,Data!$A:$D,3,FALSE))),\"\")","v":""},null,null,null,null,null,{"$f":"IF(AND(W>0,H>0),(IF(ISERROR(VLOOKUP(10,Data!$A:$D,4,FALSE)),\"\",VLOOKUP(10,Data!$A:$D,4,FALSE))),\"\")","v":""},null,"Glass:",null,null,null,null,{"$f":"IF(AND(EXTTYPE=\"HP Package\",GT=\"S\"),\"<< Must Select DS\",\"\")","v":""}]
[]
[null,{"$f":"IF(AND(W>0,H>0),(IF(ISERROR(VLOOKUP(11,Data!$A:$D,3,FALSE)),\"\",VLOOKUP(11,Data!$A:$D,3,FALSE))),\"\")","v":""},null,null,null,null,null,{"$f":"IF(AND(W>0,H>0),(IF(ISERROR(VLOOKUP(11,Data!$A:$D,4,FALSE)),\"\",VLOOKUP(11,Data!$A:$D,4,FALSE))),\"\")","v":""}]
[null,{"$f":"IF(AND(W>0,H>0),(IF(ISERROR(VLOOKUP(12,Data!$A:$D,3,FALSE)),\"\",VLOOKUP(12,Data!$A:$D,3,FALSE))),\"\")","v":""},null,null,null,null,null,{"$f":"IF(AND(W>0,H>0),(IF(ISERROR(VLOOKUP(12,Data!$A:$D,4,FALSE)),\"\",VLOOKUP(12,Data!$A:$D,4,FALSE))),\"\")","v":""}]
[null,{"$f":"IF(AND(W>0,H>0),(IF(ISERROR(VLOOKUP(13,Data!$A:$D,3,FALSE)),\"\",VLOOKUP(13,Data!$A:$D,3,FALSE))),\"\")","v":""},null,null,null,null,null,{"$f":"IF(AND(W>0,H>0),(IF(ISERROR(VLOOKUP(13,Data!$A:$D,4,FALSE)),\"\",VLOOKUP(13,Data!$A:$D,4,FALSE))),\"\")","v":""},null,null,null,null,null,"A Designated AC Sash is Used to Replace BOTH Top and Bottom Sashes When AC is in the Window"]
[null,{"$f":"IF(AND(W>0,H>0),(IF(ISERROR(VLOOKUP(14,Data!$A:$D,3,FALSE)),\"\",VLOOKUP(14,Data!$A:$D,3,FALSE))),\"\")","v":""},null,null,null,null,null,{"$f":"IF(AND(W>0,H>0),(IF(ISERROR(VLOOKUP(14,Data!$A:$D,4,FALSE)),\"\",VLOOKUP(14,Data!$A:$D,4,FALSE))),\"\")","v":""}]
[null,{"$f":"IF(AND(W>0,H>0),(IF(ISERROR(VLOOKUP(15,Data!$A:$D,3,FALSE)),\"\",VLOOKUP(15,Data!$A:$D,3,FALSE))),\"\")","v":""},null,null,null,null,null,{"$f":"IF(AND(W>0,H>0),(IF(ISERROR(VLOOKUP(15,Data!$A:$D,4,FALSE)),\"\",VLOOKUP(15,Data!$A:$D,4,FALSE))),\"\")","v":""},null,"AC Width: ",null,null,null,{"$f":"IF(AND(W>0,H>0,ACWIDTH>0,ACHEIGHT>0,ACCMR>0,ACLINK=TRUE),ACCMR,IF(AND(W>0,H>0,ACWIDTH>0,ACSASHW>0,ACLINK=TRUE),ACSASHW,\"\"))","v":""},{"$f":"IF(AND(W>0,H>0,ACWIDTH>0,ACHEIGHT>0,ACCMR>0,ACLINK=TRUE),\"<< CMR\",IF(AND(W>0,H>0,ACWIDTH>0,ACSASHW>0,ACLINK=TRUE),\"<< AC Sash Width\",\"\"))","v":""}]
[null,{"$f":"IF(AND(W>0,H>0),(IF(ISERROR(VLOOKUP(16,Data!$A:$D,3,FALSE)),\"\",VLOOKUP(16,Data!$A:$D,3,FALSE))),\"\")","v":""},null,null,null,null,null,{"$f":"IF(AND(W>0,H>0),(IF(ISERROR(VLOOKUP(16,Data!$A:$D,4,FALSE)),\"\",VLOOKUP(16,Data!$A:$D,4,FALSE))),\"\")","v":""},null,"AC Height: ",null,null,null,{"$f":"IF(AND(W>0,H>0,ACHEIGHT>0,ACSASHH>0,ACLINK=TRUE),ACSASHH,\"\")","v":""},{"$f":"IF(AND(ACCMR>0,ACLINK=TRUE),\"\",IF(AND(W>0,H>0,ACHEIGHT>0,ACSASHH>0,ACLINK=TRUE),\"<< AC Sash Height\",\"\"))","v":""}]
[null,{"$f":"IF(AND(W>0,H>0),(IF(ISERROR(VLOOKUP(17,Data!$A:$D,3,FALSE)),\"\",VLOOKUP(17,Data!$A:$D,3,FALSE))),\"\")","v":""},null,null,null,null,null,{"$f":"IF(AND(W>0,H>0),(IF(ISERROR(VLOOKUP(17,Data!$A:$D,4,FALSE)),\"\",VLOOKUP(17,Data!$A:$D,4,FALSE))),\"\")","v":""},null,{"$f":"IF(ISERROR(TSH),\"\",IF(LIMIT1>\"\",LIMIT1&IF(LIMIT2>\"\",\" & \"&LIMIT2,\"\"),\"\"))","v":""}]
[null,{"$f":"IF(AND(W>0,H>0),(IF(ISERROR(VLOOKUP(18,Data!$A:$D,3,FALSE)),\"\",VLOOKUP(18,Data!$A:$D,3,FALSE))),\"\")","v":""},null,null,null,null,null,{"$f":"IF(AND(W>0,H>0),(IF(ISERROR(VLOOKUP(18,Data!$A:$D,4,FALSE)),\"\",VLOOKUP(18,Data!$A:$D,4,FALSE))),\"\")","v":""}]
[null,{"$f":"IF(AND(W>0,H>0),(IF(ISERROR(VLOOKUP(19,Data!$A:$D,3,FALSE)),\"\",VLOOKUP(19,Data!$A:$D,3,FALSE))),\"\")","v":""},null,null,null,null,null,{"$f":"IF(AND(W>0,H>0),(IF(ISERROR(VLOOKUP(19,Data!$A:$D,4,FALSE)),\"\",VLOOKUP(19,Data!$A:$D,4,FALSE))),\"\")","v":""}]
[]
[null,null,{"$f":"IF(AND(W>0,H>0,ACWIDTH>ACSASHW,ACLINK=TRUE),\"AC Width is Larger Than The Sash Width\",\"\")","v":""}]

{"sheet":"Balance","index":1,"n_rows":271,"n_cols":53,"rows_kept":271,"cut":false,"hidden":true,"merged":[[31,47,31,48],[31,50,31,51],[0,14,0,18],[1,12,1,15],[1,17,1,20],[1,29,1,32],[2,24,2,26],[1,34,1,37],[0,29,0,37]]}
[null,null,null,null,null,null,null,null,null,null,null,null,null,null,"BLOCK & TACKLE BALANCE CHART",null,null,null,null,null,null,null,null,null,null,null,null,null,null,"V-Series BLOCK & TACKLE BALANCE CHART"]
[null,null,null,null,null,null,null,null,null,null,null,null,"TOP SASH",null,null,null,null,"BOTTOM SASH",null,null,null,null,null,null,null,null,null,null,null,"TOP SASH",null,null,null,null,"BOTTOM SASH"]
[null,"0100, 0700, 01HP, 07HP","Length","Weight/ft","Weight",null,"8001","Length","Weight/ft","Weight",null,null,"Sash Weight","Tube Length","Balance","Weight",null,"Sash Weight","Tube Length","Balance","Weight",null,null,null,"Tube Length",null,null,null,null,"Sash Weight","Tube Length","Balance","Weight",null,"Sash Weight","Tube Length","Balance","Weight",null,null,null,null,"Caldwell Balance Chart"]
[null,"Bottom Top Rail",{"$f":"(Frame_Width-2.3125)/12","v":-0.19270833333333334},0.24099999999999999,{"$f":"C4*D4","v":-4.6442708333333332E-2},null,"Top Top Rail",{"$f":"BSW/12","v":0},0.34100000000000003,{"$f":"H4*I4","v":0},null,null,{"$f":"TRUNC(TOP_WGT+GRID)","v":0},{"$f":"$M$9","v":0},"Number","Range",null,{"$f":"TRUNC(BTM_WGT+GRID)","v":0},{"$f":"$R$9","v":0},"Number","Range",null,null,null,"Model","Top","Bott",null,null,{"$f":"TRUNC(TOP_WGT)","v":0},{"$f":"TOPTUBELENGTH","v":0},"Number","Range",null,{"$f":"TRUNC(BTM_WGT)","v":0},{"$f":"BOTTUBELENGTH","v":0},"Number","Range",null,null,null,null,{"$f":"IF(OR(ModelNo=\"1700\",ModelNo=\"1720\",ModelNo=\"1730\"),1,IF(OR(ModelNo=\"1900\",ModelNo=\"1920\",ModelNo=\"1930\"),2,3))","v":3},{"$f":"IF(OR(ModelNo=\"1700\",ModelNo=\"1720\",ModelNo=\"1730\"),4,IF(OR(ModelNo=\"1900\",ModelNo=\"1920\",ModelNo=\"1930\"),5,6))","v":6},"Bott.","Top",null,1,4,2,5,3,6]
[null,"Bottom Bottom Rail",{"$f":"(Frame_Width-2.3125)/12","v":-0.19270833333333334},0.25,-4.8177083333333336E-2,null,"Top Bottom Rail",{"$f":"BSW/12","v":0},0.38400000000000001,0,null,null,"Balance Size",{"$f":"IF(AND(O5>0,P5>0),O5,0)","v":0},{"$f":"IF($N$4<=6,6,0)","v":6},{"$f":"IF(AND(O5=6,$M$4>=2,$M$4<=5),O5&\"A\",0)","v":0},null,"Balance Size",{"$f":"IF(AND(T5>0,U5>0),T5,0)","v":0},{"$f":"IF($S$4<=6,6,0)","v":6},{"$f":"IF(AND(T5=6,$R$4>=2,$R$4<=5),T5&\"A\",0)","v":0},null,null,null,"S140",null,{"$f":"(INT(INT(Frame_Height/2-0.25)/2)+0.5)*2","v":-1},null,null,"Balance Size",{"$f":"IF(AND(AF5>0,AG5>0),AF5,0)","v":0},{"$f":"IF($AE$4<=8,8,0)","v":8},{"$f":"IF(AND(AF5=8,$AD$4>=2,$AD$4<=6),AF5&\"A\",0)","v":0},null,"Balance Size",{"$f":"IF(AND(AK5>0,AL5>0),AK5,0)","v":0},{"$f":"IF($AJ$4<=8,8,0)","v":8},{"$f":"IF(AND(AK5=8,$AI$4>=2,$AI$4<=6),AK5&\"A\",0)","v":0},null,null,null,null,{"$f":"HLOOKUP($AQ$4,CALDWELL_LOOKUP,2,FALSE)","v":9},{"$f":"HLOOKUP($AR$4,CALDWELL_LOOKUP,2,FALSE)","v":9.9994999999999994},8,7,null,9.7665000000000006,10.766,9.2185000000000006,10.218,9,9.9994999999999994]
[null,"Bottom Stile",{"$f":"((CDIM_0100+0.125)*2)/12","v":2.0833333333333332E-2},0.23,4.7916666666666663E-3,null,"Top Stile",{"$f":"(BSH*2)/12","v":0},0.311,0,null,null,{"$f":"VLOOKUP((MAX(N5:N271)),N5:P271,3,FALSE)","v":0},0,6,{"$f":"IF(AND(O6=6,$M$4>=6,$M$4<=9),O6&\"B\",0)","v":0},null,{"$f":"VLOOKUP((MAX(S5:S271)),S5:U271,3,FALSE)","v":0},0,6,{"$f":"IF(AND(T6=6,$R$4>=6,$R$4<=9),T6&\"B\",0)","v":0},null,null,null,"S144",null,{"$f":"(INT(INT(Frame_Height/2-0.25)/2)+0.5)*2","v":-1},null,null,{"$f":"VLOOKUP((MAX(AE5:AE229)),AE5:AG229,3,FALSE)","v":0},0,{"$f":"IF($AE$4<=8,8,0)","v":8},{"$f":"IF(AND(AF6=8,$AD$4>=7,$AD$4<=10),AF6&\"B\",0)","v":0},null,{"$f":"VLOOKUP((MAX(AJ5:AJ229)),AJ5:AL229,3,FALSE)","v":0},0,{"$f":"IF($AJ$4<=8,8,0)","v":8},{"$f":"IF(AND(AK6=8,$AI$4>=7,$AI$4<=10),AK6&\"B\",0)","v":0},null,null,null,null,{"$f":"HLOOKUP($AQ$4,CALDWELL_LOOKUP,3,FALSE)","v":10},{"$f":"HLOOKUP($AR$4,CALDWELL_LOOKUP,3,FALSE)","v":10.999499999999999},9,8,null,10.766500000000001,11.766,10.218500000000001,11.218,10,10.999499999999999]
[null,"Bottom Rail Reinf.",{"$f":"(TRUNC(((C4*12)-6)/2)*2)/12","v":-0.66666666666666663},0.32800000000000001,-0.21866666666666668,null,"Top Stile Reinf.",0,0,0,null,null,null,0,6,{"$f":"IF(AND(O7=6,$M$4>=10,$M$4<=12),O7&\"C\",0)","v":0},null,null,0,6,{"$f":"IF(AND(T7=6,$R$4>=10,$R$4<=12),T7&\"C\",0)","v":0},null,null,null,"S146",null,{"$f":"(INT(INT(Frame_Height/2-0.25)/2)+0.5)*2","v":-1},null,null,null,0,{"$f":"IF($AE$4<=8,8,0)","v":8},{"$f":"IF(AND(AF7=8,$AD$4>=11,$AD$4<=13),AF7&\"C\",0)","v":0},null,null,0,{"$f":"IF($AJ$4<=8,8,0)","v":8},{"$f":"IF(AND(AK7=8,$AI$4>=11,$AI$4<=13),AK7&\"C\",0)","v":0},null,null,null,null,{"$f":"HLOOKUP($AQ$4,CALDWELL_LOOKUP,4,FALSE)","v":11},{"$f":"HLOOKUP($AR$4,CALDWELL_LOOKUP,4,FALSE)","v":12.999499999999999},10,9,null,11.766500000000001,13.766,11.218500000000001,13.218,11,12.999499999999999]
[null,"Bottom Stile Reinf.",0,0.23799999999999999,0,null,"Keeper Bead",{"$f":"(BSW-1.197)/12","v":-9.9750000000000005E-2},9.7000000000000003E-2,{"$f":"H8*I8","v":-9.6757500000000003E-3},null,null,"Top Tube length",0,6,{"$f":"IF(AND(O8=6,$M$4>=13,$M$4<=15),O8&\"D\",0)","v":0},null,"Bott. Tube Length",0,6,{"$f":"IF(AND(T8=6,$R$4>=13,$R$4<=15),T8&\"D\",0)","v":0},null,null,null,"R601",{"$f":"IF(DDIM_8001>=Frame_Height/2-0.07,(INT(INT((Frame_Height/2-4.75)+0.25)/2))*2,(INT(INT((DDIM_8001-4.75)+0.25)/2))*2)","v":{"$error":"#REF!"}},{"$f":"(INT(INT((Frame_Height/2-2.75)+0.25)/2)*2)","v":-4},null,null,null,0,{"$f":"IF(AND($AE$4<=10,$AE$4>8),10,0)","v":0},{"$f":"IF(AND(AF8=10,$AD$4>=2,$AD$4<=6),AF8&\"A\",0)","v":0},null,null,0,{"$f":"IF(AND($AJ$4<=10,$AJ$4>8),10,0)","v":0},{"$f":"IF(AND(AK8=10,$AI$4>=2,$AI$4<=6),AK8&\"A\",0)","v":0},null,null,null,null,{"$f":"HLOOKUP($AQ$4,CALDWELL_LOOKUP,5,FALSE)","v":13},{"$f":"HLOOKUP($AR$4,CALDWELL_LOOKUP,5,FALSE)","v":14.999499999999999},12,10,null,13.766500000000002,15.766000000000002,13.218500000000002,15.218000000000002,13,14.999499999999999]
[null,"Bottom Glass",{"$f":"((Frame_Width-4)*(CDIM_0100-1.5625))/144","v":4.3402777777777776E-2},{"$f":"GLASS_WGT","v":""},{"$f":"IF(AND(Frame_Width=35.5,Frame_Height=59.5),($C$9*$D$9)-2.25,$C$9*$D$9)","v":{"$error":"#VALUE!"}},null,"Top Glass",{"$f":"(TGW*TGH)/144","v":0},{"$f":"GLASS_WGT","v":""},{"$error":"#VALUE!"},null,null,{"$f":"IF(OR(ModelNo=\"8001\",ModelNo=\"R601\"),TOPTUBELENGTH,0)","v":0},0,6,{"$f":"IF(AND(O9=6,$M$4>=16,$M$4<=20),O9&\"E\",0)","v":0},null,{"$f":"IF(OR(ModelNo=\"8001\",ModelNo=\"R601\"),BOTTUBELENGTH,0)","v":0},0,6,{"$f":"IF(AND(T9=6,$R$4>=16,$R$4<=20),T9&\"E\",0)","v":0},null,null,null,"8001",{"$f":"IF(DDIM_8001>=Frame_Height/2-0.07,(INT(INT((Frame_Height/2-4.75)+0.25)/2))*2,(INT(INT((DDIM_8001-4.75)+0.25)/2))*2)","v":{"$error":"#REF!"}},{"$f":"(INT(INT((Frame_Height/2-2.75)+0.25)/2)*2)","v":-4},null,null,null,0,{"$f":"IF(AND($AE$4<=10,$AE$4>8),10,0)","v":0},{"$f":"IF(AND(AF9=10,$AD$4>=7,$AD$4<=10),AF9&\"B\",0)","v":0},null,null,0,{"$f":"IF(AND($AJ$4<=10,$AJ$4>8),10,0)","v":0},{"$f":"IF(AND(AK9=10,$AI$4>=7,$AI$4<=10),AK9&\"B\",0)","v":0},null,null,null,null,{"$f":"HLOOKUP($AQ$4,CALDWELL_LOOKUP,6,FALSE)","v":15.000000000000002},{"$f":"HLOOKUP($AR$4,CALDWELL_LOOKUP,6,FALSE)","v":16.999500000000001},14,12,null,15.766500000000001,17.766000000000002,15.218500000000001,17.218,15.000000000000002,16.999500000000001]
[null,"Bottom Spacer",{"$f":"(((Frame_Width-4)*2)+((CDIM_0100-1.5625)*2))/12","v":-0.92708333333333337},5.3600000000000002E-2,-4.9691666666666669E-2,null,"Top Spacer",{"$f":"((BGW*2)+(BGH*2))/12","v":0},3.4000000000000002E-2,0,null,null,null,0,6,{"$f":"IF(AND(O10=6,$M$4>=21,$M$4<=24),\"Dbl.\"&O10&\"C\",0)","v":0},null,null,0,6,{"$f":"IF(AND(T10=6,$R$4>=21,$R$4<=24),\"Dbl.\"&T10&\"C\",0)","v":0},null,null,null,"1700",null,{"$f":"VLOOKUP((CDIM_1700-0.84375),Caldwell,3)","v":{"$error":"#N/A"}},null,null,null,0,{"$f":"IF(AND($AE$4<=10,$AE$4>8),10,0)","v":0},{"$f":"IF(AND(AF10=10,$AD$4>=11,$AD$4<=13),AF10&\"C\",0)","v":0},null,null,0,{"$f":"IF(AND($AJ$4<=10,$AJ$4>8),10,0)","v":0},{"$f":"IF(AND(AK10=10,$AI$4>=11,$AI$4<=13),AK10&\"C\",0)","v":0},null,null,null,null,{"$f":"HLOOKUP($AQ$4,CALDWELL_LOOKUP,7,FALSE)","v":17},{"$f":"HLOOKUP($AR$4,CALDWELL_LOOKUP,7,FALSE)","v":18.999500000000001},16,14,null,17.766500000000001,19.766000000000002,17.218499999999999,19.218,17,18.999500000000001]
[null,"Bottom Hardware",1,0.36,0.36,null,"Top Hardware",1,0.2,0.2,null,null,null,0,6,{"$f":"IF(AND(O11=6,$M$4>=25,$M$4<=30),\"Dbl.\"&O11&\"D\",0)","v":0},null,null,0,6,{"$f":"IF(AND(T11=6,$R$4>=25,$R$4<=30),\"Dbl.\"&T11&\"D\",0)","v":0},null,null,null,"1720",null,{"$f":"VLOOKUP((CDIM_1720-0.84375),Caldwell,3)","v":{"$error":"#N/A"}},null,null,null,0,{"$f":"IF(AND($AE$4<=10,$AE$4>8),10,0)","v":0},{"$f":"IF(AND(AF11=10,$AD$4>=14,$AD$4<=16),AF11&\"D\",0)","v":0},null,null,0,{"$f":"IF(AND($AJ$4<=10,$AJ$4>8),10,0)","v":0},{"$f":"IF(AND(AK11=10,$AI$4>=14,$AI$4<=16),AK11&\"D\",0)","v":0},null,null,null,null,{"$f":"HLOOKUP($AQ$4,CALDWELL_LOOKUP,8,FALSE)","v":19},{"$f":"HLOOKUP($AR$4,CALDWELL_LOOKUP,8,FALSE)","v":20.999500000000001},18,16,null,19.766500000000001,21.766000000000002,19.218499999999999,21.218,19,20.999500000000001]
[null,"Bottom Bead",{"$f":"(((Frame_Width-3.75)*2)+((CDIM_0100-2.5)*2))/12","v":-1.0416666666666667},4.5999999999999999E-2,-4.791666666666667E-2,null,"Top Handle Bead",{"$f":"(BSW-1.197)/12","v":-9.9750000000000005E-2},9.7000000000000003E-2,-9.6757500000000003E-3,null,null,null,0,6,{"$f":"IF(AND(O12=6,$M$4>=31,$M$4<=40),\"Dbl.\"&O12&\"E\",0)","v":0},null,null,0,6,{"$f":"IF(AND(T12=6,$R$4>=31,$R$4<=40),\"Dbl.\"&T12&\"E\",0)","v":0},null,null,null,"1730",null,{"$f":"VLOOKUP((CDIM_1730-0.84375),Caldwell,3)","v":{"$error":"#N/A"}},null,null,null,0,{"$f":"IF(AND($AE$4<=12,$AE$4>10),12,0)","v":0},{"$f":"IF(AND(AF12=12,$AD$4>=3,$AD$4<=7),AF12&\"A\",0)","v":0},null,null,0,{"$f":"IF(AND($AJ$4<=12,$AJ$4>10),12,0)","v":0},{"$f":"IF(AND(AK12=12,$AI$4>=3,$AI$4<=7),AK12&\"A\",0)","v":0},null,null,null,null,{"$f":"HLOOKUP($AQ$4,CALDWELL_LOOKUP,9,FALSE)","v":21},{"$f":"HLOOKUP($AR$4,CALDWELL_LOOKUP,9,FALSE)","v":22.999500000000001},20,18,null,21.766500000000001,23.766000000000002,21.218499999999999,23.218,21,22.999500000000001]
[null,null,null,"Bottom Sash",{"$f":"TRUNC(SUM(E4:E12)+GRID)","v":{"$error":"#VALUE!"}},null,"Top Vert. Bead",{"$f":"((BSH-1.197)*2)/12","v":-0.19950000000000001},9.7000000000000003E-2,-1.9351500000000001E-2,null,null,null,0,{"$f":"IF(AND($N$4<=8,$N$4>6),8,0)","v":0},{"$f":"IF(AND(O13=8,$M$4>=2,$M$4<=6),O13&\"A\",0)","v":0},null,null,0,{"$f":"IF(AND($S$4<=8,$S$4>6),8,0)","v":0},{"$f":"IF(AND(T13=8,$R$4>=2,$R$4<=6),T13&\"A\",0)","v":0},null,null,null,"1900",null,{"$f":"VLOOKUP((CDIM_1900-0.84375),Caldwell,3)","v":{"$error":"#N/A"}},null,null,null,0,{"$f":"IF(AND($AE$4<=12,$AE$4>10),12,0)","v":0},{"$f":"IF(AND(AF13=12,$AD$4>=8,$AD$4<=10),AF13&\"B\",0)","v":0},null,null,0,{"$f":"IF(AND($AJ$4<=12,$AJ$4>10),12,0)","v":0},{"$f":"IF(AND(AK13=12,$AI$4>=8,$AI$4<=10),AK13&\"B\",0)","v":0},null,null,null,null,{"$f":"HLOOKUP($AQ$4,CALDWELL_LOOKUP,10,FALSE)","v":23},{"$f":"HLOOKUP($AR$4,CALDWELL_LOOKUP,10,FALSE)","v":24.999500000000001},22,20,null,23.766500000000001,25.766000000000002,23.218499999999999,25.218,23,24.999500000000001]
[null,null,"CDIM","DDIM",null,null,"Bottom Top Rail",{"$f":"(BSW)/12","v":0},0.42799999999999999,0,null,null,null,0,0,{"$f":"IF(AND(O14=8,$M$4>=7,$M$4<=10),O14&\"B\",0)","v":0},null,null,0,0,{"$f":"IF(AND(T14=8,$R$4>=7,$R$4<=10),T14&\"B\",0)","v":0},null,null,null,"1920",null,{"$f":"VLOOKUP((CDIM_1920-0.84375),Caldwell,3)","v":{"$error":"#N/A"}},null,null,null,0,{"$f":"IF(AND($AE$4<=12,$AE$4>10),12,0)","v":0},{"$f":"IF(AND(AF14=12,$AD$4>=11,$AD$4<=16),AF14&\"C\",0)","v":0},null,null,0,{"$f":"IF(AND($AJ$4<=12,$AJ$4>10),12,0)","v":0},{"$f":"IF(AND(AK14=12,$AI$4>=11,$AI$4<=16),AK14&\"C\",0)","v":0},null,null,null,null,{"$f":"HLOOKUP($AQ$4,CALDWELL_LOOKUP,11,FALSE)","v":25},{"$f":"HLOOKUP($AR$4,CALDWELL_LOOKUP,11,FALSE)","v":26.999500000000001},24,22,null,25.766500000000001,27.766000000000002,25.218499999999999,27.218,25,26.999500000000001]
[null,"0100",{"$f":"Frame_Height-D15","v":0},{"$f":"IF(TYPE=1,(Frame_Height/2),IF(TYPE=2,CMR))","v":0},null,null,"Bottom Bottom Rail",{"$f":"(BSW)/12","v":0},0.443,0,null,null,null,0,0,{"$f":"IF(AND(O15=8,$M$4>=11,$M$4<=13),O15&\"C\",0)","v":0},null,null,0,0,{"$f":"IF(AND(T15=8,$R$4>=11,$R$4<=13),T15&\"C\",0)","v":0},null,null,null,"1930",null,{"$f":"VLOOKUP((CDIM_1930-0.84375),Caldwell,3)","v":{"$error":"#N/A"}},null,null,null,0,{"$f":"IF(AND($AE$4<=12,$AE$4>10),12,0)","v":0},{"$f":"IF(AND(AF15=12,$AD$4>=17,$AD$4<=18),AF15&\"D\",0)","v":0},null,null,0,{"$f":"IF(AND($AJ$4<=12,$AJ$4>10),12,0)","v":0},{"$f":"IF(AND(AK15=12,$AI$4>=17,$AI$4<=18),AK15&\"D\",0)","v":0},null,null,null,null,{"$f":"HLOOKUP($AQ$4,CALDWELL_LOOKUP,12,FALSE)","v":27},{"$f":"HLOOKUP($AR$4,CALDWELL_LOOKUP,12,FALSE)","v":28.999500000000001},26,24,null,27.766500000000001,29.766000000000002,27.218499999999999,29.218,27,28.999500000000001]
[null,"02A0",{"$f":"Frame_Height-D16","v":0},{"$f":"IF(TYPE=1,(Frame_Height/2),IF(TYPE=2,CMR))","v":0},null,null,"Bottom Stile",{"$f":"(2*(BSH))/12","v":0},0.378,0,null,null,null,0,0,{"$f":"IF(AND(O16=8,$M$4>=14,$M$4<=15),O16&\"D\",0)","v":0},null,null,0,0,{"$f":"IF(AND(T16=8,$R$4>=14,$R$4<=15),T16&\"D\",0)","v":0},null,null,null,"1901",{"$f":"VLOOKUP((DDIM_1901-1),Caldwell,4)","v":{"$error":"#N/A"}},{"$f":"VLOOKUP((CDIM_1901-1),Caldwell,3)","v":{"$error":"#N/A"}},null,null,null,0,{"$f":"IF(AND($AE$4<=12,$AE$4>10),12,0)","v":0},{"$f":"IF(AND(AF16=12,$AD$4>=19,$AD$4<=21),AF16&\"E\",0)","v":0},null,null,0,{"$f":"IF(AND($AJ$4<=12,$AJ$4>10),12,0)","v":0},{"$f":"IF(AND(AK16=12,$AI$4>=19,$AI$4<=21),AK16&\"E\",0)","v":0},null,null,null,null,{"$f":"HLOOKUP($AQ$4,CALDWELL_LOOKUP,13,FALSE)","v":29},{"$f":"HLOOKUP($AR$4,CALDWELL_LOOKUP,13,FALSE)","v":30.999500000000001},28,26,null,29.766499999999997,31.765999999999998,29.218499999999995,31.217999999999996,29,30.999500000000001]
[null,"02A0","Length","Weight/ft","Weight",null,"Lock Rail Reinf.",{"$f":"(INT((BSW-6)/2)*2)/12","v":-0.5},0.31840000000000002,-0.15920000000000001,null,null,null,0,0,{"$f":"IF(AND(O17=8,$M$4>=16,$M$4<=18),O17&\"E\",0)","v":0},null,null,0,0,{"$f":"IF(AND(T17=8,$R$4>=16,$R$4<=18),T17&\"E\",0)","v":0},null,null,null,"1921",{"$f":"VLOOKUP((DDIM_1921-1),Caldwell,4)","v":{"$error":"#N/A"}},{"$f":"VLOOKUP((CDIM_1921-1),Caldwell,3)","v":{"$error":"#N/A"}},null,null,null,0,{"$f":"IF(AND($AE$4<=14,$AE$4>12),14,0)","v":0},{"$f":"IF(AND(AF17=14,$AD$4>=3,$AD$4<=7),AF17&\"A\",0)","v":0},null,null,0,{"$f":"IF(AND($AJ$4<=14,$AJ$4>12),14,0)","v":0},{"$f":"IF(AND(AK17=14,$AI$4>=3,$AI$4<=7),AK17&\"A\",0)","v":0},null,null,null,null,{"$f":"HLOOKUP($AQ$4,CALDWELL_LOOKUP,14,FALSE)","v":30.999999999999996},{"$f":"HLOOKUP($AR$4,CALDWELL_LOOKUP,14,FALSE)","v":32.999499999999998},30,28,null,31.766500000000001,33.765999999999998,31.218499999999999,33.217999999999996,30.999999999999996,32.999499999999998]
[null,"Bottom Top Rail",{"$f":"(Frame_Width-2.25)/12","v":-0.1875},0.24099999999999999,{"$f":"C18*D18","v":-4.5187499999999999E-2},null,"Bottom Stile Reinf.",{"$f":"IF(CDIM_8001>27.75,TRUNC((BSH-4.5)/2)*2,0)","v":{"$error":"#REF!"}},0,{"$error":"#REF!"},null,null,null,0,0,{"$f":"IF(AND(O18=8,$M$4>=19,$M$4<=20),\"Dbl.\"&O18&\"B\",0)","v":0},null,null,0,0,{"$f":"IF(AND(T18=8,$R$4>=19,$R$4<=20),\"Dbl.\"&T18&\"B\",0)","v":0},null,null,null,"1931",{"$f":"VLOOKUP((DDIM_1931-1),Caldwell,4)","v":{"$error":"#N/A"}},{"$f":"VLOOKUP((CDIM_1931-1),Caldwell,3)","v":{"$error":"#N/A"}},null,null,null,0,0,{"$f":"IF(AND(AF18=14,$AD$4>=8,$AD$4<=10),AF18&\"B\",0)","v":0},null,null,0,0,{"$f":"IF(AND(AK18=14,$AI$4>=8,$AI$4<=10),AK18&\"B\",0)","v":0},null,null,null,null,{"$f":"HLOOKUP($AQ$4,CALDWELL_LOOKUP,15,FALSE)","v":33},{"$f":"HLOOKUP($AR$4,CALDWELL_LOOKUP,15,FALSE)","v":34.999499999999998},32,30,null,33.766500000000001,35.765999999999998,33.218499999999999,35.217999999999996,33,34.999499999999998]
[null,"Bottom Bottom Rail",{"$f":"(Frame_Width-2.25)/12","v":-0.1875},0.25,-4.6875E-2,null,"Bottom Glass",{"$f":"(BGW*BGH)/144","v":0},{"$f":"GLASS_WGT","v":""},{"$error":"#VALUE!"},null,null,null,0,0,{"$f":"IF(AND(O19=8,$M$4>=21,$M$4<=26),\"Dbl.\"&O19&\"C\",0)","v":0},null,null,0,0,{"$f":"IF(AND(T19=8,$R$4>=21,$R$4<=26),\"Dbl.\"&T19&\"C\",0)","v":0},null,null,null,{"$f":"ModelNo","v":"Select Model"},{"$f":"IF(ISERROR(VLOOKUP($Y$19,$Y$5:$AA$18,2,FALSE)),0,VLOOKUP($Y$19,$Y$5:$AA$18,2,FALSE))","v":0},{"$f":"IF(ISERROR(VLOOKUP($Y$19,$Y$5:$AA$18,3,FALSE)),0,VLOOKUP($Y$19,$Y$5:$AA$18,3,FALSE))","v":0},null,null,null,0,0,{"$f":"IF(AND(AF19=14,$AD$4>=11,$AD$4<=16),AF19&\"C\",0)","v":0},null,null,0,0,{"$f":"IF(AND(AK19=14,$AI$4>=11,$AI$4<=16),AK19&\"C\",0)","v":0},null,null,null,null,{"$f":"HLOOKUP($AQ$4,CALDWELL_LOOKUP,16,FALSE)","v":35},{"$f":"HLOOKUP($AR$4,CALDWELL_LOOKUP,16,FALSE)","v":36.999499999999998},34,32,null,35.766500000000001,37.765999999999998,35.218499999999999,37.217999999999996,35,36.999499999999998]
[null,"Bottom Stile",{"$f":"((CDIM_02A0-0.75)*2)/12","v":-0.125},0.23,-2.8750000000000001E-2,null,"Bottom Spacer",{"$f":"((BGW*2)+(BGH*2))/12","v":0},3.4000000000000002E-2,0,null,null,null,0,0,{"$f":"IF(AND(O20=8,$M$4>=27,$M$4<=32),\"Dbl.\"&O20&\"D\",0)","v":0},null,null,0,0,{"$f":"IF(AND(T20=8,$R$4>=27,$R$4<=32),\"Dbl.\"&T20&\"D\",0)","v":0},null,null,null,null,null,null,null,null,null,0,0,{"$f":"IF(AND(AF20=14,$AD$4>=17,$AD$4<=19),AF20&\"D\",0)","v":0},null,null,0,0,{"$f":"IF(AND(AK20=14,$AI$4>=17,$AI$4<=19),AK20&\"D\",0)","v":0},null,null,null,null,{"$f":"HLOOKUP($AQ$4,CALDWELL_LOOKUP,17,FALSE)","v":37},{"$f":"HLOOKUP($AR$4,CALDWELL_LOOKUP,17,FALSE)","v":38.999499999999998},36,34,null,37.766500000000001,39.765999999999998,37.218499999999999,39.217999999999996,37,38.999499999999998]
[null,"Bottom Rail Reinf.",{"$f":"(TRUNC(((C18*12)-6)/2)*2)/12","v":-0.66666666666666663},0.32800000000000001,-0.21866666666666668,null,"Bottom Hardware",1,0.36,0.36,null,null,null,0,0,{"$f":"IF(AND(O21=8,$M$4>=33,$M$4<=36),\"Dbl.\"&O21&\"E\",0)","v":0},null,null,0,0,{"$f":"IF(AND(T21=8,$R$4>=33,$R$4<=36),\"Dbl.\"&T21&\"E\",0)","v":0},null,null,null,null,null,null,null,null,null,0,0,{"$f":"IF(AND(AF21=14,$AD$4>=20,$AD$4<=22),AF21&\"E\",0)","v":0},null,null,0,0,{"$f":"IF(AND(AK21=14,$AI$4>=20,$AI$4<=22),AK21&\"E\",0)","v":0},null,null,null,null,{"$f":"HLOOKUP($AQ$4,CALDWELL_LOOKUP,18,FALSE)","v":39},{"$f":"HLOOKUP($AR$4,CALDWELL_LOOKUP,18,FALSE)","v":40.999499999999998},38,36,null,39.766500000000001,41.765999999999998,39.218499999999999,41.217999999999996,39,40.999499999999998]
[null,"Bottom Stile Reinf.",{"$f":"IF((CDIM_02A0-2.40625)>=27.5,((((CDIM_02A0-2.40625)-4.5)/2)*2)/12,0)","v":0},0.23799999999999999,0,null,"Bott. Hor. Bead",{"$f":"(2*(BSW-2.197))/12","v":-0.3661666666666667},9.7000000000000003E-2,-3.551816666666667E-2,null,null,null,0,{"$f":"IF(AND($N$4<=10,$N$4>8),10,0)","v":0},{"$f":"IF(AND(O22=10,$M$4>=1,$M$4<=6),O22&\"A\",0)","v":0},null,null,0,{"$f":"IF(AND($S$4<=10,$S$4>8),10,0)","v":0},{"$f":"IF(AND(T22=10,$R$4>=1,$R$4<=6),T22&\"A\",0)","v":0},null,null,null,null,null,null,null,null,null,0,0,{"$f":"IF(AND(AF22=14,$AD$4>=23,$AD$4<=25),AF22&\"F\",0)","v":0},null,null,0,0,{"$f":"IF(AND(AK22=14,$AI$4>=23,$AI$4<=25),AK22&\"F\",0)","v":0},null,null,null,null,{"$f":"HLOOKUP($AQ$4,CALDWELL_LOOKUP,19,FALSE)","v":41},{"$f":"HLOOKUP($AR$4,CALDWELL_LOOKUP,19,FALSE)","v":42.999499999999998},40,38,null,41.766500000000001,43.765999999999998,41.218499999999999,43.217999999999996,41,42.999499999999998]
[null,"Bottom Glass",{"$f":"((Frame_Width-3.90625)*(CDIM_02A0-2.40625))/144","v":6.5273708767361105E-2},{"$f":"GLASS_WGT","v":""},{"$error":"#VALUE!"},null,"Bottom Vert. Bead",{"$f":"(2*(BSH-2.197))/12","v":-0.3661666666666667},9.7000000000000003E-2,-3.551816666666667E-2,null,null,null,0,0,{"$f":"IF(AND(O23=10,$M$4>=7,$M$4<=10),O23&\"B\",0)","v":0},null,null,0,0,{"$f":"IF(AND(T23=10,$R$4>=7,$R$4<=10),T23&\"B\",0)","v":0},null,null,null,null,null,null,null,null,null,0,{"$f":"IF(AND($AE$4<=16,$AE$4>14),16,0)","v":0},{"$f":"IF(AND(AF23=16,$AD$4>=3,$AD$4<=7),AF23&\"A\",0)","v":0},null,null,0,{"$f":"IF(AND($AJ$4<=16,$AJ$4>14),16,0)","v":0},{"$f":"IF(AND(AK23=16,$AI$4>=3,$AI$4<=7),AK23&\"A\",0)","v":0},null,null,null,null,{"$f":"HLOOKUP($AQ$4,CALDWELL_LOOKUP,20,FALSE)","v":43},{"$f":"HLOOKUP($AR$4,CALDWELL_LOOKUP,20,FALSE)","v":44.999499999999998},42,40,null,43.766500000000001,45.765999999999998,43.218499999999999,45.217999999999996,43,44.999499999999998]
[null,"Bottom Spacer",{"$f":"(((Frame_Width-3.90625)*2)+((CDIM_02A0-2.40625)*2))/12","v":-1.0520833333333333},5.3600000000000002E-2,-5.6391666666666666E-2,null,null,null,"Top Sash",{"$f":"TRUNC((SUM(J4:J13))+6.5+GRID)","v":{"$error":"#VALUE!"}},null,null,null,0,0,{"$f":"IF(AND(O24=10,$M$4>=11,$M$4<=13),O24&\"C\",0)","v":0},null,null,0,0,{"$f":"IF(AND(T24=10,$R$4>=11,$R$4<=13),T24&\"C\",0)","v":0},null,null,null,null,null,null,null,null,null,0,0,{"$f":"IF(AND(AF24=16,$AD$4>=8,$AD$4<=10),AF24&\"B\",0)","v":0},null,null,0,0,{"$f":"IF(AND(AK24=16,$AI$4>=8,$AI$4<=10),AK24&\"B\",0)","v":0},null,null,null,null,{"$f":"HLOOKUP($AQ$4,CALDWELL_LOOKUP,21,FALSE)","v":45},{"$f":"HLOOKUP($AR$4,CALDWELL_LOOKUP,21,FALSE)","v":46.999499999999998},44,42,null,45.766500000000001,47.765999999999998,45.218499999999999,47.217999999999996,45,46.999499999999998]
[null,"Bottom Hardware",1,0.36,0.36,null,null,null,"Bottom Sash",{"$f":"TRUNC(SUM(J14:J23)+GRID)","v":{"$error":"#REF!"}},null,null,null,0,0,{"$f":"IF(AND(O25=10,$M$4>=14,$M$4<=16),O25&\"D\",0)","v":0},null,null,0,0,{"$f":"IF(AND(T25=10,$R$4>=14,$R$4<=16),T25&\"D\",0)","v":0},null,null,null,null,null,null,null,null,null,0,0,{"$f":"IF(AND(AF25=16,$AD$4>=11,$AD$4<=16),AF25&\"C\",0)","v":0},null,null,0,0,{"$f":"IF(AND(AK25=16,$AI$4>=11,$AI$4<=16),AK25&\"C\",0)","v":0},null,null,null,null,{"$f":"HLOOKUP($AQ$4,CALDWELL_LOOKUP,22,FALSE)","v":47},{"$f":"HLOOKUP($AR$4,CALDWELL_LOOKUP,22,FALSE)","v":48.999499999999998},46,44,null,47.766500000000001,49.765999999999998,47.218499999999999,49.217999999999996,47,48.999499999999998]
[null,"Bottom Bead",{"$f":"(((Frame_Width-3.3125)*2)+((CDIM_02A0-1.8125)*2))/12","v":-0.85416666666666663},2.8000000000000001E-2,-2.3916666666666666E-2,null,null,null,null,null,null,null,null,0,0,{"$f":"IF(AND(O26=10,$M$4>=17,$M$4<=19),O26&\"E\",0)","v":0},null,null,0,0,{"$f":"IF(AND(T26=10,$R$4>=17,$R$4<=19),T26&\"E\",0)","v":0},null,null,null,null,null,null,null,null,null,0,0,{"$f":"IF(AND(AF26=16,$AD$4>=17,$AD$4<=19),AF26&\"D\",0)","v":0},null,null,0,0,{"$f":"IF(AND(AK26=16,$AI$4>=17,$AI$4<=19),AK26&\"D\",0)","v":0}]
[null,null,null,"Bottom Sash",{"$f":"TRUNC(SUM(E18:E26)+GRID)","v":{"$error":"#VALUE!"}},null,null,null,null,null,null,null,null,0,0,{"$f":"IF(AND(O27=10,$M$4=20),\"Dbl.\"&O27&\"B\",0)","v":0},null,null,0,0,{"$f":"IF(AND(T27=10,$R$4=20),\"Dbl.\"&T27&\"B\",0)","v":0},null,null,null,null,null,null,null,null,null,0,0,{"$f":"IF(AND(AF27=16,$AD$4>=20,$AD$4<=22),AF27&\"E\",0)","v":0},null,null,0,0,{"$f":"IF(AND(AK27=16,$AI$4>=20,$AI$4<=22),AK27&\"E\",0)","v":0}]
[null,null,null,null,null,null,null,null,null,null,null,null,null,0,0,{"$f":"IF(AND(O28=10,$M$4>=21,$M$4<=26),\"Dbl.\"&O28&\"C\",0)","v":0},null,null,0,0,{"$f":"IF(AND(T28=10,$R$4>=21,$R$4<=26),\"Dbl.\"&T28&\"C\",0)","v":0},null,null,null,null,null,null,null,null,null,0,0,{"$f":"IF(AND(AF28=16,$AD$4>=23,$AD$4<=24),AF28&\"F\",0)","v":0},null,null,0,0,{"$f":"IF(AND(AK28=16,$AI$4>=23,$AI$4<=24),AK28&\"F\",0)","v":0}]
[null,null,null,null,null,null,null,null,null,null,null,null,null,0,0,{"$f":"IF(AND(O29=10,$M$4>=27,$M$4<=32),\"Dbl.\"&O29&\"D\",0)","v":0},null,null,0,0,{"$f":"IF(AND(T29=10,$R$4>=27,$R$4<=32),\"Dbl.\"&T29&\"D\",0)","v":0},null,null,null,null,null,null,null,null,null,0,0,{"$f":"IF(AND(AF29=16,$AD$4>=25,$AD$4<=27),AF29&\"G\",0)","v":0},null,null,0,0,{"$f":"IF(AND(AK29=16,$AI$4>=25,$AI$4<=27),AK29&\"G\",0)","v":0}]
[null,"1700 / 1720 / 1730","Length","Weight/ft","Weight",null,"3001","Length","Weight/ft","Weight",null,null,null,0,0,{"$f":"IF(AND(O30=10,$M$4>=33,$M$4<=38),\"Dbl.\"&O30&\"E\",0)","v":0},null,null,0,0,{"$f":"IF(AND(T30=10,$R$4>=33,$R$4<=38),\"Dbl.\"&T30&\"E\",0)","v":0},null,null,null,null,null,null,null,null,null,0,{"$f":"IF(AND($AE$4<=18,$AE$4>16),18,0)","v":0},{"$f":"IF(AND(AF30=18,$AD$4>=4,$AD$4<=9),AF30&\"A\",0)","v":0},null,null,0,{"$f":"IF(AND($AJ$4<=18,$AJ$4>16),18,0)","v":0},{"$f":"IF(AND(AK30=18,$AI$4>=4,$AI$4<=9),AK30&\"A\",0)","v":0}]
[null,"Bottom Top Rail",{"$f":"BSW/12","v":0},0.221,{"$f":"C31*D31","v":0},null,"Top Top Rail",{"$f":"(TSW)/12","v":0},0.29699999999999999,{"$f":"H31*I31","v":0},null,null,null,0,{"$f":"IF(AND($N$4<=12,$N$4>10),12,0)","v":0},{"$f":"IF(AND(O31=12,$M$4>=3,$M$4<=7),O31&\"A\",0)","v":0},null,null,0,{"$f":"IF(AND($S$4<=12,$S$4>10),12,0)","v":0},{"$f":"IF(AND(T31=12,$R$4>=3,$R$4<=7),T31&\"A\",0)","v":0},null,null,null,null,null,null,null,null,null,0,0,{"$f":"IF(AND(AF31=18,$AD$4>=10,$AD$4<=13),AF31&\"B\",0)","v":0},null,null,0,0,{"$f":"IF(AND(AK31=18,$AI$4>=10,$AI$4<=13),AK31&\"B\",0)","v":0}]
[null,"Bottom Bottom Rail",{"$f":"BSW/12","v":0},0.19600000000000001,0,null,"Top Bottom Rail",{"$f":"(TSW)/12","v":0},0.28899999999999998,0,null,null,null,0,0,{"$f":"IF(AND(O32=12,$M$4>=8,$M$4<=10),O32&\"B\",0)","v":0},null,null,0,0,{"$f":"IF(AND(T32=12,$R$4>=8,$R$4<=10),T32&\"B\",0)","v":0},null,null,null,null,null,null,null,null,null,0,0,{"$f":"IF(AND(AF32=18,$AD$4>=14,$AD$4<=18),AF32&\"C\",0)","v":0},null,null,0,0,{"$f":"IF(AND(AK32=18,$AI$4>=14,$AI$4<=18),AK32&\"C\",0)","v":0},null,null,null,null,null,null,null,null,null,"Sash Height",null,"Balance ","Window Height 50/50 Split",null,"Oriel LBML"]
[null,"Bottom Stile",{"$f":"(BSH*2)/12","v":0},0.19600000000000001,0,null,"Top Stile",{"$f":"(2*TSH)/12","v":0},0.218,0,null,null,null,0,0,{"$f":"IF(AND(O33=12,$M$4>=11,$M$4<=16),O33&\"C\",0)","v":0},null,null,0,0,{"$f":"IF(AND(T33=12,$R$4>=11,$R$4<=16),T33&\"C\",0)","v":0},null,null,null,null,null,null,null,null,null,0,0,{"$f":"IF(AND(AF33=18,$AD$4>=19,$AD$4<=21),AF33&\"D\",0)","v":0},null,null,0,0,{"$f":"IF(AND(AK33=18,$AI$4>=19,$AI$4<=21),AK33&\"D\",0)","v":0},null,null,null,null,null,null,null,null,null,"Min Height"," Max Height","Size","Min Height"," Max Height","from Bot of Sill"]
[null,"Bottom Rail Reinf.",{"$f":"IF(AND(STILE_REINF>0,ModelNo=\"1700\"),(TRUNC(((Frame_Width-3.625)-0.5)/2)*2-2)/12,IF(AND(STILE_REINF>0,ModelNo=\"1720\"),(TRUNC((((Frame_Width/2-2.4375)-6.25)-0.5)/2)*2)/12,IF(AND(STILE_REINF>0,ModelNo=\"1730\"),(TRUNC((((Frame_Width/3-2.53125)-7)-0.5)/2)*2)/12,0)))","v":0},0.13300000000000001,0,null,"Keeper Rail Reinf.",{"$f":"(TRUNC(((Frame_Width-4.125)-2)/2)*2)/12","v":-0.5},{"$f":"IF(OR(EXTSELECT=2,Frame_Width<48,Frame_Height<84),0.0516,IF(OR(EXTSELECT=3,Frame_Width>48,Frame_Height>84),0.3784,0))","v":5.16E-2},-2.58E-2,null,null,null,0,0,{"$f":"IF(AND(O34=12,$M$4>=17,$M$4<=18),O34&\"D\",0)","v":0},null,null,0,0,{"$f":"IF(AND(T34=12,$R$4>=17,$R$4<=18),T34&\"D\",0)","v":0},null,null,null,null,null,null,null,null,null,0,0,{"$f":"IF(AND(AF34=18,$AD$4>=22,$AD$4<=24),AF34&\"E\",0)","v":0},null,null,0,0,{"$f":"IF(AND(AK34=18,$AI$4>=22,$AI$4<=24),AK34&\"E\",0)","v":0}]
[null,"Bottom Stile Reinf.",{"$f":"IF(AND(STILE_REINF>0,ModelNo=\"1700\"),(((((CDIM_1700-4.03125))/2)*2)/12)*2,IF(AND(STILE_REINF>0,ModelNo=\"1720\"),(((((CDIM_1720-4.03125))/2)*2)/12)*2,IF(AND(STILE_REINF>0,ModelNo=\"1730\"),(((((CDIM_1730-4.03125))/2)*2)/12)*2,0)))","v":0},0.13300000000000001,0,null,"Top Stile Reinf",{"$f":"IF(OR(Frame_Width>48,Frame_Height>84,EXTTYPE=\"Steel\"),((TRUNC(((DDIM_3001-1.625)-8)/2)*2)/12)*2,0)","v":0},0.45600000000000002,0,null,null,null,0,0,{"$f":"IF(AND(O35=12,$M$4>=19,$M$4<=21),O35&\"E\",0)","v":0},null,null,0,0,{"$f":"IF(AND(T35=12,$R$4>=19,$R$4<=21),T35&\"E\",0)","v":0},null,null,null,null,null,null,null,null,null,0,0,{"$f":"IF(AND(AF35=18,$AD$4>=25,$AD$4<=26),AF35&\"F\",0)","v":0},null,null,0,0,{"$f":"IF(AND(AK35=18,$AI$4>=25,$AI$4<=26),AK35&\"F\",0)","v":0},null,null,null,null,null,null,null,null,null,9.7665000000000006,10.766,8,21.125,23.123999999999999,20.283000000000001]
[null,"Bottom Glass",{"$f":"(BGW*BGH)/144","v":0},{"$f":"GLASS_WGT","v":""},{"$error":"#VALUE!"},null,"Top Glass",{"$f":"(TGW*TGH)/144","v":0},{"$f":"GLASS_WGT","v":""},{"$f":"H36*I36","v":{"$error":"#VALUE!"}},null,null,null,0,0,{"$f":"IF(AND(O36=12,$M$4>=22,$M$4<=32),\"Dbl.\"&O36&\"C\",0)","v":0},null,null,0,0,{"$f":"IF(AND(T36=12,$R$4>=22,$R$4<=32),\"Dbl.\"&T36&\"C\",0)","v":0},null,null,null,null,null,null,null,null,null,0,0,{"$f":"IF(AND(AF36=18,$AD$4>=27,$AD$4<=29),AF36&\"G\",0)","v":0},null,null,0,0,{"$f":"IF(AND(AK36=18,$AI$4>=27,$AI$4<=29),AK36&\"G\",0)","v":0},null,null,null,null,null,null,null,null,null,10.766500000000001,11.766,9,23.125,25.123999999999999,22.283000000000001]
[null,"Bottom Spacer",{"$f":"((BGW*2)+(BGH*2))/12","v":0},5.3600000000000002E-2,0,null,"Top Spacer",{"$f":"((TGW*2)+(TGH*2))/12","v":0},5.3600000000000002E-2,0,null,null,null,{"$f":"IF(AND(O37>0,P37>0),O37,0)","v":0},0,{"$f":"IF(AND(O37=12,$M$4>=33,$M$4<=36),\"Dbl.\"&O37&\"D\",0)","v":0},null,null,0,0,{"$f":"IF(AND(T37=12,$R$4>=33,$R$4<=36),\"Dbl.\"&T37&\"D\",0)","v":0},null,null,null,null,null,null,null,null,null,0,0,{"$f":"IF(AND(AF37=18,$AD$4>=30,$AD$4<=32),AF37&\"H\",0)","v":0},null,null,0,0,{"$f":"IF(AND(AK37=18,$AI$4>=30,$AI$4<=32),AK37&\"H\",0)","v":0},null,null,null,null,null,null,null,null,null,11.766500000000001,13.766,10,25.125,29.123999999999999,26.283000000000001]
[null,"Bottom Hardware",1,0.36,0.36,null,"Top Hardware",1,0.4,0.4,null,null,null,0,0,{"$f":"IF(AND(O38=12,$M$4>=37,$M$4<=42),\"Dbl.\"&O38&\"E\",0)","v":0},null,null,0,0,{"$f":"IF(AND(T38=12,$R$4>=37,$R$4<=42),\"Dbl.\"&T38&\"E\",0)","v":0},null,null,null,null,null,null,null,null,null,0,{"$f":"IF(AND($AE$4<=20,$AE$4>18),20,0)","v":0},{"$f":"IF(AND(AF38=20,$AD$4>=5,$AD$4<=10),AF38&\"A\",0)","v":0},null,null,0,{"$f":"IF(AND($AJ$4<=20,$AJ$4>18),20,0)","v":0},{"$f":"IF(AND(AK38=20,$AI$4>=5,$AI$4<=10),AK38&\"A\",0)","v":0},null,null,null,null,null,null,null,null,null,13.766500000000002,15.766000000000002,12,29.125000000000004,33.124000000000002,30.283000000000001]
[null,"Bottom Bead",{"$f":"(((BSW-0.75)*2)+((BSH-0.781)*2))/12","v":-0.25516666666666671},2.1000000000000001E-2,-5.3585000000000013E-3,null,"Top Bead",{"$f":"(((Frame_Width-5.125)*2)+((DDIM_3001-4.3125)*2))/12","v":-1.5729166666666667},7.1999999999999995E-2,-0.11325,null,null,null,0,{"$f":"IF(AND($N$4<=14,$N$4>12),14,0)","v":0},{"$f":"IF(AND(O39=14,$M$4>=3,$M$4<=7),O39&\"A\",0)","v":0},null,null,0,{"$f":"IF(AND($S$4<=14,$S$4>12),14,0)","v":0},{"$f":"IF(AND(T39=14,$R$4>=3,$R$4<=7),T39&\"A\",0)","v":0},null,null,null,null,null,null,null,null,null,0,0,{"$f":"IF(AND(AF39=20,$AD$4>=11,$AD$4<=14),AF39&\"B\",0)","v":0},null,null,0,0,{"$f":"IF(AND(AK39=20,$AI$4>=11,$AI$4<=14),AK39&\"B\",0)","v":0},null,null,null,null,null,null,null,null,null,15.766500000000001,17.766000000000002,14,33.125,37.124000000000002,34.283000000000001]
[null,null,null,"Bottom Sash",{"$f":"TRUNC(SUM(E31:E39)+GRID)","v":{"$error":"#VALUE!"}},null,"Bottom Top Rail",{"$f":"(Frame_Width-3.125)/12","v":-0.26041666666666669},0.29699999999999999,-7.7343750000000003E-2,null,null,null,0,0,{"$f":"IF(AND(O40=14,$M$4>=8,$M$4<=10),O40&\"B\",0)","v":0},null,null,0,0,{"$f":"IF(AND(T40=14,$R$4>=8,$R$4<=10),T40&\"B\",0)","v":0},null,null,null,null,null,null,null,null,null,0,0,{"$f":"IF(AND(AF40=20,$AD$4>=15,$AD$4<=18),AF40&\"C\",0)","v":0},null,null,0,0,{"$f":"IF(AND(AK40=20,$AI$4>=15,$AI$4<=18),AK40&\"C\",0)","v":0},null,null,null,null,null,null,null,null,null,17.766500000000001,19.766000000000002,16,37.125,41.124000000000002,38.282999999999994]
[null,null,null,null,null,null,"Bottom Bottom Rail",{"$f":"(Frame_Width-3.125)/12","v":-0.26041666666666669},0.23200000000000001,-6.0416666666666674E-2,null,null,null,0,0,{"$f":"IF(AND(O41=14,$M$4>=11,$M$4<=16),O41&\"C\",0)","v":0},null,null,0,0,{"$f":"IF(AND(T41=14,$R$4>=11,$R$4<=16),T41&\"C\",0)","v":0},null,null,null,null,null,null,null,null,null,0,0,{"$f":"IF(AND(AF41=20,$AD$4>=19,$AD$4<=22),AF41&\"D\",0)","v":0},null,null,0,0,{"$f":"IF(AND(AK41=20,$AI$4>=19,$AI$4<=22),AK41&\"D\",0)","v":0},null,null,null,null,null,null,null,null,null,19.766500000000001,21.766000000000002,18,41.125,45.124000000000002,42.282999999999994]
[null,"1900","Length","Weight/ft","Weight",null,"Bottom Stile",{"$f":"(2*BSH)/12","v":0},0.219,0,null,null,null,0,0,{"$f":"IF(AND(O42=14,$M$4>=17,$M$4<=19),O42&\"D\",0)","v":0},null,null,0,0,{"$f":"IF(AND(T42=14,$R$4>=17,$R$4<=19),T42&\"D\",0)","v":0},null,null,null,null,null,null,null,null,null,0,0,{"$f":"IF(AND(AF42=20,$AD$4>=23,$AD$4<=26),AF42&\"E\",0)","v":0},null,null,0,0,{"$f":"IF(AND(AK42=20,$AI$4>=23,$AI$4<=26),AK42&\"E\",0)","v":0},null,null,null,null,null,null,null,null,null,21.766500000000001,23.766000000000002,20,45.125,49.124000000000002,46.282999999999994]
[null,"Bottom Top Rail",{"$f":"BSW/12","v":0},0.221,{"$f":"C43*D43","v":0},null,"Bottom Rail Reinf.",{"$f":"(TRUNC(((Frame_Width-3.125)-6)/2)*2)/12","v":-0.66666666666666663},{"$f":"IF(OR(EXTSELECT=2,Frame_Width<48,Frame_Height<84),0.0516,IF(OR(EXTSELECT=3,Frame_Width>48,Frame_Height>84),0.57,0))","v":5.16E-2},-3.44E-2,null,null,null,0,0,{"$f":"IF(AND(O43=14,$M$4>=20,$M$4<=22),O43&\"E\",0)","v":0},null,null,0,0,{"$f":"IF(AND(T43=14,$R$4>=20,$R$4<=22),T43&\"E\",0)","v":0},null,null,null,null,null,null,null,null,null,0,0,{"$f":"IF(AND(AF43=20,$AD$4>=27,$AD$4<=30),AF43&\"F\",0)","v":0},null,null,0,0,{"$f":"IF(AND(AK43=20,$AI$4>=27,$AI$4<=30),AK43&\"F\",0)","v":0},null,null,null,null,null,null,null,null,null,23.766500000000001,25.766000000000002,22,49.125,53.124000000000002,50.282999999999994]
[null,"Bottom Bottom Rail",{"$f":"BSW/12","v":0},0.19600000000000001,0,null,"Bottom Stile Reinf.",{"$f":"IF(OR(Frame_Width>48,Frame_Height>84,EXTTYPE=\"Steel\"),((TRUNC((CDIM_3001-2)/2)*2)/12)*2,0)","v":0},0.45600000000000002,0,null,null,null,0,0,{"$f":"IF(AND(O44=14,$M$4>=23,$M$4<=25),O44&\"F\",0)","v":0},null,null,0,0,{"$f":"IF(AND(T44=14,$R$4>=23,$R$4<=25),T44&\"F\",0)","v":0},null,null,null,null,null,null,null,null,null,0,0,{"$f":"IF(AND(AF44=20,$AD$4>=31,$AD$4<=34),AF44&\"G\",0)","v":0},null,null,0,0,{"$f":"IF(AND(AK44=20,$AI$4>=31,$AI$4<=34),AK44&\"G\",0)","v":0},null,null,null,null,null,null,null,null,null,25.766500000000001,27.766000000000002,24,53.125,57.124000000000002,54.282999999999994]
[null,"Bottom Stile",{"$f":"(BSH*2)/12","v":0},0.19600000000000001,0,null,"Bottom Glass",{"$f":"(BGW*BGH)/144","v":0},{"$f":"GLASS_WGT","v":""},{"$error":"#VALUE!"},null,null,null,0,0,{"$f":"IF(AND(O45=14,$M$4>=26,$M$4<=28),O45&\"G\",0)","v":0},null,null,0,0,{"$f":"IF(AND(T45=14,$R$4>=26,$R$4<=28),T45&\"G\",0)","v":0},null,null,null,null,null,null,null,null,null,0,{"$f":"IF(AND($AE$4<=22,$AE$4>20),22,0)","v":0},{"$f":"IF(AND(AF45=22,$AD$4>=5,$AD$4<=10),AF45&\"A\",0)","v":0},null,null,0,{"$f":"IF(AND($AJ$4<=22,$AJ$4>20),22,0)","v":0},{"$f":"IF(AND(AK45=22,$AI$4>=5,$AI$4<=10),AK45&\"A\",0)","v":0},null,null,null,null,null,null,null,null,null,27.766500000000001,29.766000000000002,26,57.125,61.124000000000002,58.282999999999994]
[null,"Bott Rail Reinf.",{"$f":"IF(AND(STILE_REINF>0,ModelNo=\"1900\"),(TRUNC(((Frame_Width-8.688)-0.5)/2)*2)/12,IF(AND(STILE_REINF>0,ModelNo=\"1920\"),(TRUNC(((Frame_Width/2-8.9375)-0.5)/2)*2)/12,IF(AND(STILE_REINF>0,ModelNo=\"1920\"),(TRUNC(((Frame_Width/3-8.9375)-0.5)/2)*2)/12,0)))","v":0},0.13300000000000001,0,null,"Bottom Spacer",{"$f":"((BGW*2)+(BGH*2))/12","v":0},5.3600000000000002E-2,0,null,null,null,0,0,{"$f":"IF(AND(O46=14,$M$4>=29,$M$4<=31),O46&\"H\",0)","v":0},null,null,0,0,{"$f":"IF(AND(T46=14,$R$4>=29,$R$4<=31),T46&\"H\",0)","v":0},null,null,null,null,null,null,null,null,null,0,0,{"$f":"IF(AND(AF46=22,$AD$4>=11,$AD$4<=16),AF46&\"B\",0)","v":0},null,null,0,0,{"$f":"IF(AND(AK46=22,$AI$4>=11,$AI$4<=16),AK46&\"B\",0)","v":0},null,null,null,null,null,null,null,null,null,29.766499999999997,31.765999999999998,28,61.124999999999993,65.123999999999995,62.282999999999994]
[null,"Bottom Stile Reinf.",{"$f":"IF(AND(STILE_REINF>0,ModelNo=\"1900\"),(((((CDIM_1900-4.094))/2)*2)/12)*2,IF(AND(STILE_REINF>0,ModelNo=\"1900\"),(((((CDIM_1920-4.094))/2)*2)/12)*2,IF(AND(STILE_REINF>0,ModelNo=\"1930\"),(((((CDIM_1900-4.094))/2)*2)/12)*2,0)))","v":0},0.13300000000000001,0,null,"Bottom Hardware",1,0.36,0.36,null,null,null,0,0,{"$f":"IF(AND(O47=14,$M$4>=32,$M$4<=34),O47&\"I\",0)","v":0},null,null,0,0,{"$f":"IF(AND(T47=14,$R$4>=32,$R$4<=34),T47&\"I\",0)","v":0},null,null,null,null,null,null,null,null,null,0,0,{"$f":"IF(AND(AF47=22,$AD$4>=17,$AD$4<=21),AF47&\"C\",0)","v":0},null,null,0,0,{"$f":"IF(AND(AK47=22,$AI$4>=17,$AI$4<=21),AK47&\"C\",0)","v":0},null,null,null,null,null,null,null,null,null,31.766500000000001,33.765999999999998,30,65.125,69.123999999999995,66.282999999999987]
[null,"Bottom Glass",{"$f":"(BGW*BGH)/144","v":0},{"$f":"GLASS_WGT","v":""},{"$error":"#VALUE!"},null,"Bottom Bead",{"$f":"(((Frame_Width-4.125)*2)+((CDIM_3001-3.3125)*2))/12","v":-1.2395833333333333},7.1999999999999995E-2,-8.9249999999999982E-2,null,null,null,0,0,{"$f":"IF(AND(O48=14,$M$4>=35,$M$4<=38),\"Dbl.\"&O48&\"D\",0)","v":0},null,null,0,0,{"$f":"IF(AND(T48=14,$R$4>=35,$R$4<=38),\"Dbl.\"&T48&\"D\",0)","v":0},null,null,null,null,null,null,null,null,null,0,0,{"$f":"IF(AND(AF48=22,$AD$4>=22,$AD$4<=24),AF48&\"D\",0)","v":0},null,null,0,0,{"$f":"IF(AND(AK48=22,$AI$4>=22,$AI$4<=24),AK48&\"D\",0)","v":0},null,null,null,null,null,null,null,null,null,33.766500000000001,35.765999999999998,32,69.125,73.123999999999995,70.283000000000001]
[null,"Bottom Spacer",{"$f":"((BGW*2)+(BGH*2))/12","v":0},5.3600000000000002E-2,0,null,null,null,"Top Sash",{"$f":"TRUNC(SUM(J31:J39)+1+GRID)","v":{"$error":"#VALUE!"}},null,null,null,0,0,{"$f":"IF(AND(O49=14,$M$4>=39,$M$4<=44),\"Dbl.\"&O49&\"E\",0)","v":0},null,null,0,0,{"$f":"IF(AND(T49=14,$R$4>=39,$R$4<=44),\"Dbl.\"&T49&\"E\",0)","v":0},null,null,null,null,null,null,null,null,null,0,0,{"$f":"IF(AND(AF49=22,$AD$4>=25,$AD$4<=27),AF49&\"E\",0)","v":0},null,null,0,0,{"$f":"IF(AND(AK49=22,$AI$4>=25,$AI$4<=27),AK49&\"E\",0)","v":0},null,null,null,null,null,null,null,null,null,35.766500000000001,37.765999999999998,34,73.125,77.123999999999995,74.283000000000001]
[null,"Bottom Hardware",1,0.36,0.36,null,null,null,"Bottom Sash",{"$f":"TRUNC(SUM(J40:J48)+GRID)","v":{"$error":"#VALUE!"}},null,null,null,0,0,{"$f":"IF(AND(O50=14,$M$4>=45,$M$4<=50),\"Dbl.\"&O50&\"F\",0)","v":0},null,null,0,0,{"$f":"IF(AND(T50=14,$R$4>=45,$R$4<=50),\"Dbl.\"&T50&\"F\",0)","v":0},null,null,null,null,null,null,null,null,null,0,0,{"$f":"IF(AND(AF50=22,$AD$4>=28,$AD$4<=30),AF50&\"F\",0)","v":0},null,null,0,0,{"$f":"IF(AND(AK50=22,$AI$4>=28,$AI$4<=30),AK50&\"F\",0)","v":0},null,null,null,null,null,null,null,null,null,37.766500000000001,39.765999999999998,36,77.125,81.123999999999995,78.283000000000001]
[null,"Bottom Bead",{"$f":"(((BSW-0.75)*2)+((BSH-0.781)*2))/12","v":-0.25516666666666671},2.1000000000000001E-2,-5.3585000000000013E-3,null,null,null,null,null,null,null,null,0,0,{"$f":"IF(AND(O51=14,$M$4>=51,$M$4<=56),\"Dbl.\"&O51&\"G\",0)","v":0},null,null,0,0,{"$f":"IF(AND(T51=14,$R$4>=51,$R$4<=56),\"Dbl.\"&T51&\"G\",0)","v":0},null,null,null,null,null,null,null,null,null,0,0,{"$f":"IF(AND(AF51=22,$AD$4>=31,$AD$4<=34),AF51&\"G\",0)","v":0},null,null,0,0,{"$f":"IF(AND(AK51=22,$AI$4>=31,$AI$4<=34),AK51&\"G\",0)","v":0},null,null,null,null,null,null,null,null,null,39.766500000000001,41.765999999999998,38,81.125,85.123999999999995,82.283000000000001]
[null,null,null,"Bottom Sash",{"$f":"TRUNC(SUM(E43:E51)+GRID)","v":{"$error":"#VALUE!"}},null,"L201",null,null,null,null,null,null,0,0,{"$f":"IF(AND(O52=14,$M$4>=57,$M$4<=62),\"Dbl.\"&O52&\"H\",0)","v":0},null,null,0,0,{"$f":"IF(AND(T52=14,$R$4>=57,$R$4<=62),\"Dbl.\"&T52&\"H\",0)","v":0},null,null,null,null,null,null,null,null,null,0,0,{"$f":"IF(AND(AF52=22,$AD$4>=35,$AD$4<=37),AF52&\"H\",0)","v":0},null,null,0,0,{"$f":"IF(AND(AK52=22,$AI$4>=35,$AI$4<=37),AK52&\"H\",0)","v":0},null,null,null,null,null,null,null,null,null,41.766500000000001,43.765999999999998,40,85.125,89.123999999999995,86.283000000000001]
[null,null,null,null,null,null,"Top Top Rail",{"$f":"TSW/12","v":0},0.25700000000000001,{"$f":"H53*I53","v":0},null,null,null,0,0,{"$f":"IF(AND(O53=14,$M$4>=63,$M$4<=68),\"Dbl.\"&O53&\"I\",0)","v":0},null,null,0,0,{"$f":"IF(AND(T53=14,$R$4>=63,$R$4<=68),\"Dbl.\"&T53&\"I\",0)","v":0},null,null,null,null,null,null,null,null,null,0,{"$f":"IF(AND($AE$4<=24,$AE$4>22),24,0)","v":0},{"$f":"IF(AND(AF53=24,$AD$4>=6,$AD$4<=10),AF53&\"A\",0)","v":0},null,null,0,{"$f":"IF(AND($AJ$4<=24,$AJ$4>22),24,0)","v":0},{"$f":"IF(AND(AK53=24,$AI$4>=6,$AI$4<=10),AK53&\"A\",0)","v":0},null,null,null,null,null,null,null,null,null,43.766500000000001,45.765999999999998,42,89.125,93.123999999999995,90.283000000000001]
[null,null,null,null,null,null,"Top Bottom Rail",{"$f":"TSW/12","v":0},0.27300000000000002,{"$f":"H54*I54","v":0},null,null,null,0,{"$f":"IF(AND($N$4<=16,$N$4>14),16,0)","v":0},{"$f":"IF(AND(O54=16,$M$4>=3,$M$4<=7),O54&\"A\",0)","v":0},null,null,0,{"$f":"IF(AND($S$4<=16,$S$4>14),16,0)","v":0},{"$f":"IF(AND(T54=16,$R$4>=3,$R$4<=7),T54&\"A\",0)","v":0},null,null,null,null,null,null,null,null,null,0,0,{"$f":"IF(AND(AF54=24,$AD$4>=11,$AD$4<=17),AF54&\"B\",0)","v":0},null,null,0,0,{"$f":"IF(AND(AK54=24,$AI$4>=11,$AI$4<=17),AK54&\"B\",0)","v":0},null,null,null,null,null,null,null,null,null,45.766500000000001,47.765999999999998,44,93.125,97.123999999999995,94.283000000000001]
[null,"03A0",null,null,null,null,"Top Stile",{"$f":"2*TSH/12","v":0},0.23300000000000001,0,null,null,null,0,0,{"$f":"IF(AND(O55=16,$M$4>=8,$M$4<=10),O55&\"B\",0)","v":0},null,null,0,0,{"$f":"IF(AND(T55=16,$R$4>=8,$R$4<=10),T55&\"B\",0)","v":0},null,null,null,null,null,null,null,null,null,0,0,{"$f":"IF(AND(AF55=24,$AD$4>=18,$AD$4<=22),AF55&\"C\",0)","v":0},null,null,0,0,{"$f":"IF(AND(AK55=24,$AI$4>=18,$AI$4<=22),AK55&\"C\",0)","v":0},null,null,null,null,null,null,null,null,null,47.766500000000001,49.765999999999998,46,97.125,101.124,98.283000000000001]
[null,"Bottom Top Rail",{"$f":"BSW/12","v":0},0.29699999999999999,{"$f":"C56*D56","v":0},null,"Top Rail Reinf.",{"$f":"(((TSW-6)/2)*2)/12","v":-0.5},5.1999999999999998E-2,-2.5999999999999999E-2,null,null,null,0,0,{"$f":"IF(AND(O56=16,$M$4>=11,$M$4<=16),O56&\"C\",0)","v":0},null,null,0,0,{"$f":"IF(AND(T56=16,$R$4>=11,$R$4<=16),T56&\"C\",0)","v":0},null,null,null,null,null,null,null,null,null,0,0,{"$f":"IF(AND(AF56=24,$AD$4>=23,$AD$4<=25),AF56&\"D\",0)","v":0},null,null,0,0,{"$f":"IF(AND(AK56=24,$AI$4>=23,$AI$4<=25),AK56&\"D\",0)","v":0},null,null,null,null,null,null,null,null,null,null,null,null,null,null,{"$f":"IF(TYPE=2,Frame_Height-(VLOOKUP(BSH,AV35:BA55,6)),2.625)","v":2.625}]
[null,"Bottom Bottom Rail",{"$f":"BSW/12","v":0},0.23200000000000001,{"$f":"C57*D57","v":0},null,"Top Stile Reinf",{"$f":"IF(TGH>26.75,(((DDIM_L201-9.5)/2)*2)/12,0)","v":0},5.1999999999999998E-2,0,null,null,null,0,0,{"$f":"IF(AND(O57=16,$M$4>=17,$M$4<=19),O57&\"D\",0)","v":0},null,null,0,0,{"$f":"IF(AND(T57=16,$R$4>=17,$R$4<=19),T57&\"D\",0)","v":0},null,null,null,null,null,null,null,null,null,0,0,{"$f":"IF(AND(AF57=24,$AD$4>=26,$AD$4<=28),AF57&\"E\",0)","v":0},null,null,0,0,{"$f":"IF(AND(AK57=24,$AI$4>=26,$AI$4<=28),AK57&\"E\",0)","v":0}]
[null,"Bottom Stile",{"$f":"(BSH*2)/12","v":0},0.219,0,null,"Top Glass",{"$f":"(TGW*TGH)/144","v":0},{"$f":"GLASS_WGT","v":""},{"$error":"#VALUE!"},null,null,null,0,0,{"$f":"IF(AND(O58=16,$M$4>=20,$M$4<=22),O58&\"E\",0)","v":0},null,null,0,0,{"$f":"IF(AND(T58=16,$R$4>=20,$R$4<=22),T58&\"E\",0)","v":0},null,null,null,null,null,null,null,null,null,0,0,{"$f":"IF(AND(AF58=24,$AD$4>=29,$AD$4<=30),AF58&\"F\",0)","v":0},null,null,0,0,{"$f":"IF(AND(AK58=24,$AI$4>=29,$AI$4<=30),AK58&\"F\",0)","v":0}]
[null,"Bottom Rail Reinf.",{"$f":"(2*(CDIM_03A0-1.125))/12","v":-0.1875},5.16E-2,-9.6749999999999996E-3,null,"Top Spacer",{"$f":"((TGW*2)+(TGH*2))/12","v":0},5.3600000000000002E-2,0,null,null,null,0,0,{"$f":"IF(AND(O59=16,$M$4>=23,$M$4<=24),O59&\"F\",0)","v":0},null,null,0,0,{"$f":"IF(AND(T59=16,$R$4>=23,$R$4<=24),T59&\"F\",0)","v":0},null,null,null,null,null,null,null,null,null,0,0,{"$f":"IF(AND(AF59=24,$AD$4>=31,$AD$4<=34),AF59&\"G\",0)","v":0},null,null,0,0,{"$f":"IF(AND(AK59=24,$AI$4>=31,$AI$4<=34),AK59&\"G\",0)","v":0}]
[null,"Bottom Stile Reinf.",{"$f":"(TRUNC(((Frame_Width-3.125)-6)/2)*2)/12","v":-0.66666666666666663},0.45600000000000002,-0.30399999999999999,null,"Top Hardware",1,0.2,0.2,null,null,null,0,0,{"$f":"IF(AND(O60=16,$M$4>=25,$M$4<=28),O60&\"G\",0)","v":0},null,null,0,0,{"$f":"IF(AND(T60=16,$R$4>=25,$R$4<=28),T60&\"G\",0)","v":0},null,null,null,null,null,null,null,null,null,0,0,{"$f":"IF(AND(AF60=24,$AD$4>=35,$AD$4<=37),AF60&\"H\",0)","v":0},null,null,0,0,{"$f":"IF(AND(AK60=24,$AI$4>=35,$AI$4<=37),AK60&\"H\",0)","v":0}]
[null,"Bottom Glass",{"$f":"(BGW*BGH)/144","v":0},{"$f":"GLASS_WGT","v":""},{"$error":"#VALUE!"},null,"Top Bead",{"$f":"(((Frame_Width-4.3125)*2)+((DDIM_L201-2.625)*2))/12","v":-1.15625},2.8000000000000001E-2,-3.2375000000000001E-2,null,null,null,0,0,{"$f":"IF(AND(O61=16,$M$4>=29,$M$4<=31),O61&\"H\",0)","v":0},null,null,0,0,{"$f":"IF(AND(T61=16,$R$4>=29,$R$4<=31),T61&\"H\",0)","v":0},null,null,null,null,null,null,null,null,null,0,{"$f":"IF(AND($AE$4<=26,$AE$4>24),26,0)","v":0},{"$f":"IF(AND(AF61=26,$AD$4>=6,$AD$4<=11),AF61&\"A\",0)","v":0},null,null,0,{"$f":"IF(AND($AJ$4<=26,$AJ$4>24),26,0)","v":0},{"$f":"IF(AND(AK61=26,$AI$4>=6,$AI$4<=11),AK61&\"A\",0)","v":0}]
[null,"Bottom Spacer",{"$f":"((BGW*2)+(BGH*2))/12","v":0},5.3600000000000002E-2,0,null,"Bottom Top Rail",{"$f":"BSW/12","v":0},0.246,0,null,null,null,0,0,{"$f":"IF(AND(O62=16,$M$4>=32,$M$4<=34),O62&\"I\",0)","v":0},null,null,0,0,{"$f":"IF(AND(T62=16,$R$4>=32,$R$4<=34),T62&\"I\",0)","v":0},null,null,null,null,null,null,null,null,null,0,0,{"$f":"IF(AND(AF62=26,$AD$4>=12,$AD$4<=17),AF62&\"B\",0)","v":0},null,null,0,0,{"$f":"IF(AND(AK62=26,$AI$4>=12,$AI$4<=17),AK62&\"B\",0)","v":0}]
[null,"Bottom Hardware",1,0.36,0.36,null,"Bottom Bottom Rail",{"$f":"BSW/12","v":0},0.25700000000000001,0,null,null,null,0,0,{"$f":"IF(AND(O63=16,$M$4>=35,$M$4<=36),\"Dbl.\"&O63&\"D\",0)","v":0},null,null,0,0,{"$f":"IF(AND(T63=16,$R$4>=35,$R$4<=36),\"Dbl.\"&T63&\"D\",0)","v":0},null,null,null,null,null,null,null,null,null,0,0,{"$f":"IF(AND(AF63=26,$AD$4>=18,$AD$4<=22),AF63&\"C\",0)","v":0},null,null,0,0,{"$f":"IF(AND(AK63=26,$AI$4>=18,$AI$4<=22),AK63&\"C\",0)","v":0}]
[null,"Bottom Bead",{"$f":"(((Frame_Width-4.125)*2)+((CDIM_03A0-3.3125)*2))/12","v":-1.2395833333333333},7.1999999999999995E-2,-8.9249999999999982E-2,null,"Bottom Stile",{"$f":"2*BSH/12","v":0},0.23300000000000001,0,null,null,null,0,0,{"$f":"IF(AND(O64=16,$M$4>=37,$M$4<=44),\"Dbl.\"&O64&\"E\",0)","v":0},null,null,0,0,{"$f":"IF(AND(T64=16,$R$4>=37,$R$4<=44),\"Dbl.\"&T64&\"E\",0)","v":0},null,null,null,null,null,null,null,null,null,0,0,{"$f":"IF(AND(AF64=26,$AD$4>=23,$AD$4<=26),AF64&\"D\",0)","v":0},null,null,0,0,{"$f":"IF(AND(AK64=26,$AI$4>=23,$AI$4<=26),AK64&\"D\",0)","v":0}]
[null,null,null,"Bott. Sash",{"$f":"TRUNC(SUM(E56:E64)+GRID)","v":{"$error":"#VALUE!"}},null,"Bottom Rail Reinf.",{"$f":"(((BSW-6)/2)*2)/12","v":-0.5},5.1999999999999998E-2,-2.5999999999999999E-2,null,null,null,0,0,{"$f":"IF(AND(O65=16,$M$4>=45,$M$4<=48),\"Dbl.\"&O65&\"F\",0)","v":0},null,null,0,0,{"$f":"IF(AND(T65=16,$R$4>=45,$R$4<=48),\"Dbl.\"&T65&\"F\",0)","v":0},null,null,null,null,null,null,null,null,null,0,0,{"$f":"IF(AND(AF65=26,$AD$4>=27,$AD$4<=30),AF65&\"E\",0)","v":0},null,null,0,0,{"$f":"IF(AND(AK65=26,$AI$4>=27,$AI$4<=30),AK65&\"E\",0)","v":0}]
[null,null,null,null,null,null,"Bottom Stile Reinf.",{"$f":"IF(BGH>27.75,((CDIM_L201-4.5)/2)*2,0)","v":0},5.1999999999999998E-2,0,null,null,null,0,0,{"$f":"IF(AND(O66=16,$M$4>=49,$M$4<=56),\"Dbl.\"&O66&\"G\",0)","v":0},null,null,0,0,{"$f":"IF(AND(T66=16,$R$4>=49,$R$4<=56),\"Dbl.\"&T66&\"G\",0)","v":0},null,null,null,null,null,null,null,null,null,0,0,{"$f":"IF(AND(AF66=26,$AD$4>=31,$AD$4<=34),AF66&\"F\",0)","v":0},null,null,0,0,{"$f":"IF(AND(AK66=26,$AI$4>=31,$AI$4<=34),AK66&\"F\",0)","v":0}]
[null,"1901/1921/1931","Length","Weight/ft","Weight",null,"Bottom Glass",{"$f":"(BGW*BGH)/144","v":0},{"$f":"GLASS_WGT","v":""},{"$error":"#VALUE!"},null,null,null,0,0,{"$f":"IF(AND(O67=16,$M$4>=57,$M$4<=62),\"Dbl.\"&O67&\"H\",0)","v":0},null,null,0,0,{"$f":"IF(AND(T67=16,$R$4>=57,$R$4<=62),\"Dbl.\"&T67&\"H\",0)","v":0},null,null,null,null,null,null,null,null,null,0,0,{"$f":"IF(AND(AF67=26,$AD$4>=35,$AD$4<=38),AF67&\"G\",0)","v":0},null,null,0,0,{"$f":"IF(AND(AK67=26,$AI$4>=35,$AI$4<=38),AK67&\"G\",0)","v":0}]
[null,"Top Top Rail",{"$f":"IF(ModelNo=\"1901\",(Frame_Width-3.4375)/12,IF(ModelNo=\"1921\",(Frame_Width/2-3.6875)/12,IF(ModelNo=\"1931\",(Frame_Width/3-3.75)/12,0)))","v":0},0.20799999999999999,{"$f":"C68*D68","v":0},null,"Bottom Spacer",{"$f":"((BGW*2)+(BGH*2))/12","v":0},5.3600000000000002E-2,0,null,null,null,0,0,{"$f":"IF(AND(O68=16,$M$4>=63,$M$4<=68),\"Dbl.\"&O68&\"I\",0)","v":0},null,null,0,0,{"$f":"IF(AND(T68=16,$R$4>=63,$R$4<=68),\"Dbl.\"&T68&\"I\",0)","v":0},null,null,null,null,null,null,null,null,null,0,0,{"$f":"IF(AND(AF68=26,$AD$4>=39,$AD$4<=42),AF68&\"H\",0)","v":0},null,null,0,0,{"$f":"IF(AND(AK68=26,$AI$4>=39,$AI$4<=42),AK68&\"H\",0)","v":0}]
[null,"Top Bottom Rail",{"$f":"IF(ModelNo=\"1901\",(Frame_Width-3.4375)/12,IF(ModelNo=\"1921\",(Frame_Width/2-3.6875)/12,IF(ModelNo=\"1931\",(Frame_Width/3-3.75)/12,0)))","v":0},0.23799999999999999,0,null,"Bottom Hardware",1,0.36,0.36,null,null,null,{"$f":"IF(AND(O69>0,P69>0),O69,0)","v":0},{"$f":"IF(AND($N$4<=18,$N$4>16),18,0)","v":0},{"$f":"IF(AND(O69=18,$M$4>=4,$M$4<=9),O69&\"A\",0)","v":0},null,null,{"$f":"IF(AND(T69>0,U69>0),T69,0)","v":0},{"$f":"IF(AND($S$4<=18,$S$4>16),18,0)","v":0},{"$f":"IF(AND(T69=18,$R$4>=4,$R$4<=9),T69&\"A\",0)","v":0},null,null,null,null,null,null,null,null,null,{"$f":"IF(AND(AF69>0,AG69>0),AF69,0)","v":0},{"$f":"IF(AND($AE$4<=28,$AE$4>26),28,0)","v":0},{"$f":"IF(AND(AF69=28,$AD$4>=7,$AD$4<=12),AF69&\"A\",0)","v":0},null,null,{"$f":"IF(AND(AK69>0,AL69>0),AK69,0)","v":0},{"$f":"IF(AND($AJ$4<=28,$AJ$4>26),28,0)","v":0},{"$f":"IF(AND(AK69=28,$AI$4>=7,$AI$4<=12),AK69&\"A\",0)","v":0}]
[null,"Top Stile",{"$f":"(2*(CDIM_1901-0.90625))/12","v":-0.15104166666666666},0.19600000000000001,-2.9604166666666668E-2,null,"Bottom Bead",{"$f":"(((Frame_Width-3.3125)*2)/12)+(((CDIM_L201-1.625)*2)/12)","v":-0.82291666666666674},2.8000000000000001E-2,-2.3041666666666669E-2,null,null,null,0,0,{"$f":"IF(AND(O70=18,$M$4>=10,$M$4<=13),O70&\"B\",0)","v":0},null,null,0,0,{"$f":"IF(AND(T70=18,$R$4>=10,$R$4<=13),T70&\"B\",0)","v":0},null,null,null,null,null,null,null,null,null,0,0,{"$f":"IF(AND(AF70=28,$AD$4>=13,$AD$4<=18),AF70&\"B\",0)","v":0},null,null,0,0,{"$f":"IF(AND(AK70=28,$AI$4>=13,$AI$4<=18),AK70&\"B\",0)","v":0}]
[null,"Top Rail Reinf.",{"$f":"IF(ModelNo=\"1901\",(Frame_Width-9.4375)/12,IF(ModelNo=\"1921\",(Frame_Width/2-9.6875)/12,IF(ModelNo=\"1931\",(Frame_Width/3-9.75)/12,0)))","v":0},0.10100000000000001,0,null,null,null,"Top Sash",{"$f":"TRUNC(SUM(J53:J61)+1+GRID)","v":{"$error":"#VALUE!"}},null,null,null,0,0,{"$f":"IF(AND(O71=18,$M$4>=14,$M$4<=18),O71&\"C\",0)","v":0},null,null,0,0,{"$f":"IF(AND(T71=18,$R$4>=14,$R$4<=18),T71&\"C\",0)","v":0},null,null,null,null,null,null,null,null,null,0,0,{"$f":"IF(AND(AF71=28,$AD$4>=19,$AD$4<=23),AF71&\"C\",0)","v":0},null,null,0,0,{"$f":"IF(AND(AK71=28,$AI$4>=19,$AI$4<=23),AK71&\"C\",0)","v":0}]
[null,"Top Stile Reinf",{"$f":"IF(STILE_REINF>0,(((((DDIM_1901-11))/2)*2)/12)*2,0)","v":0},0.13300000000000001,0,null,null,null,"Bott. Sash",{"$f":"TRUNC(SUM(J62:J70)+GRID)","v":{"$error":"#VALUE!"}},null,null,null,0,0,{"$f":"IF(AND(O72=18,$M$4>=19,$M$4<=21),O72&\"D\",0)","v":0},null,null,0,0,{"$f":"IF(AND(T72=18,$R$4>=19,$R$4<=21),T72&\"D\",0)","v":0},null,null,null,null,null,null,null,null,null,0,0,{"$f":"IF(AND(AF72=28,$AD$4>=24,$AD$4<=28),AF72&\"D\",0)","v":0},null,null,0,0,{"$f":"IF(AND(AK72=28,$AI$4>=24,$AI$4<=28),AK72&\"D\",0)","v":0}]
[null,"Top Glass",{"$f":"IF(ModelNo=\"1901\",(Data!D580*Data!D581)/144,IF(ModelNo=\"1921\",(Data!D597*Data!D598)/144,IF(ModelNo=\"1931\",(Data!D614*Data!D615)/144,0)))","v":0},{"$f":"GLASS_WGT","v":""},{"$error":"#VALUE!"},null,null,null,null,null,null,null,null,0,0,{"$f":"IF(AND(O73=18,$M$4>=22,$M$4<=24),O73&\"E\",0)","v":0},null,null,0,0,{"$f":"IF(AND(T73=18,$R$4>=22,$R$4<=24),T73&\"E\",0)","v":0},null,null,null,null,null,null,null,null,null,0,0,{"$f":"IF(AND(AF73=28,$AD$4>=29,$AD$4<=32),AF73&\"E\",0)","v":0},null,null,0,0,{"$f":"IF(AND(AK73=28,$AI$4>=29,$AI$4<=32),AK73&\"E\",0)","v":0}]
[null,"Top Spacer",{"$f":"IF(ModelNo=\"1901\",((Data!D580*2)+(Data!D581*2))/12,IF(ModelNo=\"1901\",((Data!D597*2)+(Data!D598*2))/12,IF(ModelNo=\"1901\",((Data!D614*2)+(Data!D615*2))/12,0)))","v":0},5.3600000000000002E-2,0,null,null,null,null,null,null,null,null,0,0,{"$f":"IF(AND(O74=18,$M$4>=25,$M$4<=26),O74&\"F\",0)","v":0},null,null,0,0,{"$f":"IF(AND(T74=18,$R$4>=25,$R$4<=26),T74&\"F\",0)","v":0},null,null,null,null,null,null,null,null,null,0,0,{"$f":"IF(AND(AF74=28,$AD$4>=33,$AD$4<=36),AF74&\"F\",0)","v":0},null,null,0,0,{"$f":"IF(AND(AK74=28,$AI$4>=33,$AI$4<=36),AK74&\"F\",0)","v":0}]
[null,"Top Hardware",1,0.2,0.2,null,null,null,null,null,null,null,null,0,0,{"$f":"IF(AND(O75=18,$M$4>=27,$M$4<=29),O75&\"G\",0)","v":0},null,null,0,0,{"$f":"IF(AND(T75=18,$R$4>=27,$R$4<=29),T75&\"G\",0)","v":0},null,null,null,null,null,null,null,null,null,0,0,{"$f":"IF(AND(AF75=28,$AD$4>=37,$AD$4<=40),AF75&\"G\",0)","v":0},null,null,0,0,{"$f":"IF(AND(AK75=28,$AI$4>=37,$AI$4<=40),AK75&\"G\",0)","v":0}]
[null,"Top Bead",{"$f":"(((Frame_Width-4.2)*2)+((DDIM_1901-1.75)*2))/12","v":-0.9916666666666667},2.1000000000000001E-2,-2.0825000000000003E-2,null,null,null,null,null,null,null,null,0,0,{"$f":"IF(AND(O76=18,$M$4>=30,$M$4<=32),O76&\"H\",0)","v":0},null,null,0,0,{"$f":"IF(AND(T76=18,$R$4>=30,$R$4<=32),T76&\"H\",0)","v":0},null,null,null,null,null,null,null,null,null,0,0,{"$f":"IF(AND(AF76=28,$AD$4>=41,$AD$4<=43),AF76&\"H\",0)","v":0},null,null,0,0,{"$f":"IF(AND(AK76=28,$AI$4>=41,$AI$4<=43),AK76&\"H\",0)","v":0}]
[null,"Bottom Top Rail",{"$f":"IF(ModelNo=\"1901\",(Frame_Width-2.1875)/12,IF(ModelNo=\"1921\",(Frame_Width/2-2.4375)/12,IF(ModelNo=\"1931\",(Frame_Width/3-2.5)/12,0)))","v":0},0.221,0,null,null,null,null,null,null,null,null,0,0,{"$f":"IF(AND(O77=18,$M$4>=33,$M$4<=34),O77&\"I\",0)","v":0},null,null,0,0,{"$f":"IF(AND(T77=18,$R$4>=33,$R$4<=34),T77&\"I\",0)","v":0},null,null,null,null,null,null,null,null,null,0,0,{"$f":"IF(AND(AF77=28,$AD$4>=44,$AD$4<=45),AF77&\"I\",0)","v":0},null,null,0,0,{"$f":"IF(AND(AK77=28,$AI$4>=44,$AI$4<=45),AK77&\"I\",0)","v":0}]
[null,"Bottom Bottom Rail",{"$f":"IF(ModelNo=\"1901\",(Frame_Width-2.1875)/12,IF(ModelNo=\"1921\",(Frame_Width/2-2.4375)/12,IF(ModelNo=\"1931\",(Frame_Width/3-2.5)/12,0)))","v":0},0.19600000000000001,0,null,null,null,null,null,null,null,null,0,0,{"$f":"IF(AND(O78=18,$M$4>=35,$M$4<=36),\"Dbl.\"&O78&\"C\",0)","v":0},null,null,0,0,{"$f":"IF(AND(T78=18,$R$4>=35,$R$4<=36),\"Dbl.\"&T78&\"C\",0)","v":0},null,null,null,null,null,null,null,null,null,0,{"$f":"IF(AND($AE$4<=30,$AE$4>28),30,0)","v":0},{"$f":"IF(AND(AF78=30,$AD$4>=8,$AD$4<=13),AF78&\"A\",0)","v":0},null,null,0,{"$f":"IF(AND($AJ$4<=30,$AJ$4>28),30,0)","v":0},{"$f":"IF(AND(AK78=30,$AI$4>=8,$AI$4<=13),AK78&\"A\",0)","v":0}]
[null,"Bottom Stile",{"$f":"(2*(CDIM_1901-0.90925))/12","v":-0.15154166666666666},0.19600000000000001,-2.9702166666666665E-2,null,null,null,null,null,null,null,null,0,0,{"$f":"IF(AND(O79=18,$M$4>=37,$M$4<=42),\"Dbl.\"&O79&\"D\",0)","v":0},null,null,0,0,{"$f":"IF(AND(T79=18,$R$4>=37,$R$4<=42),\"Dbl.\"&T79&\"D\",0)","v":0},null,null,null,null,null,null,null,null,null,0,0,{"$f":"IF(AND(AF79=30,$AD$4>=14,$AD$4<=19),AF79&\"B\",0)","v":0},null,null,0,0,{"$f":"IF(AND(AK79=30,$AI$4>=14,$AI$4<=19),AK79&\"B\",0)","v":0}]
[null,"DS_Bott Rail Reinf.",{"$f":"IF(AND(ModelNo=\"1901\",STILE_REINF>0),(Frame_Width-8.4375)/12,IF(AND(ModelNo=\"1921\",STILE_REINF>0),(Frame_Width/2-8.6875)/12,IF(AND(ModelNo=\"1931\",STILE_REINF>0),(Frame_Width/3-8.75)/12,0)))","v":0},0.13300000000000001,{"$f":"C80*D80","v":0},null,null,null,null,null,null,null,null,0,0,{"$f":"IF(AND(O80=18,$M$4>=43,$M$4<=48),\"Dbl.\"&O80&\"E\",0)","v":0},null,null,0,0,{"$f":"IF(AND(T80=18,$R$4>=43,$R$4<=48),\"Dbl.\"&T80&\"E\",0)","v":0},null,null,null,null,null,null,null,null,null,0,0,{"$f":"IF(AND(AF80=30,$AD$4>=20,$AD$4<=24),AF80&\"C\",0)","v":0},null,null,0,0,{"$f":"IF(AND(AK80=30,$AI$4>=20,$AI$4<=24),AK80&\"C\",0)","v":0}]
[null,"Bottom Stile Reinf.",{"$f":"IF(STILE_REINF>0,(((((CDIM_1901-4.25))/2)*2)/12)*2,0)","v":0},0.13300000000000001,0,null,null,null,null,null,null,null,null,0,0,{"$f":"IF(AND(O81=18,$M$4>=49,$M$4<=52),\"Dbl.\"&O81&\"F\",0)","v":0},null,null,0,0,{"$f":"IF(AND(T81=18,$R$4>=49,$R$4<=52),\"Dbl.\"&T81&\"F\",0)","v":0},null,null,null,null,null,null,null,null,null,0,0,{"$f":"IF(AND(AF81=30,$AD$4>=25,$AD$4<=29),AF81&\"D\",0)","v":0},null,null,0,0,{"$f":"IF(AND(AK81=30,$AI$4>=25,$AI$4<=29),AK81&\"D\",0)","v":0}]
[null,"Bottom Glass",{"$f":"IF(ModelNo=\"1901\",(Data!D582*Data!D583)/144,IF(ModelNo=\"1921\",(Data!D599*Data!D600)/144,IF(ModelNo=\"1931\",(Data!D616*Data!D617)/144,0)))","v":0},{"$f":"GLASS_WGT","v":""},{"$error":"#VALUE!"},null,null,null,null,null,null,null,null,0,0,{"$f":"IF(AND(O82=18,$M$4>=53,$M$4<=58),\"Dbl.\"&O82&\"G\",0)","v":0},null,null,0,0,{"$f":"IF(AND(T82=18,$R$4>=53,$R$4<=58),\"Dbl.\"&T82&\"G\",0)","v":0},null,null,null,null,null,null,null,null,null,0,0,{"$f":"IF(AND(AF82=30,$AD$4>=30,$AD$4<=33),AF82&\"E\",0)","v":0},null,null,0,0,{"$f":"IF(AND(AK82=30,$AI$4>=30,$AI$4<=33),AK82&\"E\",0)","v":0}]
[null,"Bottom Spacer",{"$f":"IF(ModelNo=\"1901\",((Data!D582*2)+(Data!D583*2))/12,IF(ModelNo=\"1921\",((Data!D599*2)+(Data!D600*2))/12,IF(ModelNo=\"1931\",((Data!D616*2)+(Data!D617*2))/12,0)))","v":0},5.3600000000000002E-2,0,null,null,null,null,null,null,null,null,0,0,{"$f":"IF(AND(O83=18,$M$4>=59,$M$4<=64),\"Dbl.\"&O83&\"H\",0)","v":0},null,null,0,0,{"$f":"IF(AND(T83=18,$R$4>=59,$R$4<=64),\"Dbl.\"&T83&\"H\",0)","v":0},null,null,null,null,null,null,null,null,null,0,0,{"$f":"IF(AND(AF83=30,$AD$4>=34,$AD$4<=37),AF83&\"F\",0)","v":0},null,null,0,0,{"$f":"IF(AND(AK83=30,$AI$4>=34,$AI$4<=37),AK83&\"F\",0)","v":0}]
[null,"Bottom Hardware",1,0.36,0.36,null,null,null,null,null,null,null,null,0,0,{"$f":"IF(AND(O84=18,$M$4>=65,$M$4<=68),\"Dbl.\"&O84&\"I\",0)","v":0},null,null,0,0,{"$f":"IF(AND(T84=18,$R$4>=65,$R$4<=68),\"Dbl.\"&T84&\"I\",0)","v":0},null,null,null,null,null,null,null,null,null,0,0,{"$f":"IF(AND(AF84=30,$AD$4>=38,$AD$4<=40),AF84&\"G\",0)","v":0},null,null,0,0,{"$f":"IF(AND(AK84=30,$AI$4>=38,$AI$4<=40),AK84&\"G\",0)","v":0}]
[null,"Bottom Bead",{"$f":"(((Frame_Width-2.95)*2)+((CDIM_1901-1.75)*2))/12","v":-0.78333333333333333},2.1000000000000001E-2,-1.6449999999999999E-2,null,null,null,null,null,null,null,null,0,{"$f":"IF(AND($N$4<=20,$N$4>18),20,0)","v":0},{"$f":"IF(AND(O85=20,$M$4>=5,$M$4<=10),O85&\"A\",0)","v":0},null,null,0,{"$f":"IF(AND($S$4<=20,$S$4>18),20,0)","v":0},{"$f":"IF(AND(T85=20,$R$4>=5,$R$4<=10),T85&\"A\",0)","v":0},null,null,null,null,null,null,null,null,null,0,0,{"$f":"IF(AND(AF85=30,$AD$4>=41,$AD$4<=43),AF85&\"H\",0)","v":0},null,null,0,0,{"$f":"IF(AND(AK85=30,$AI$4>=41,$AI$4<=43),AK85&\"H\",0)","v":0}]
[null,null,null,"Top Sash",{"$f":"TRUNC(SUM(E68:E76)+3+GRID)","v":{"$error":"#VALUE!"}},null,null,null,null,null,null,null,null,0,0,{"$f":"IF(AND(O86=20,$M$4>=11,$M$4<=14),O86&\"B\",0)","v":0},null,null,0,0,{"$f":"IF(AND(T86=20,$R$4>=11,$R$4<=14),T86&\"B\",0)","v":0},null,null,null,null,null,null,null,null,null,0,0,{"$f":"IF(AND(AF86=30,$AD$4>=44,$AD$4<=45),AF86&\"I\",0)","v":0},null,null,0,0,{"$f":"IF(AND(AK86=30,$AI$4>=44,$AI$4<=45),AK86&\"I\",0)","v":0}]
[null,null,null,"Bottom Sash",{"$f":"TRUNC(SUM(E77:E85)+GRID)","v":{"$error":"#VALUE!"}},null,null,null,null,null,null,null,null,0,0,{"$f":"IF(AND(O87=20,$M$4>=15,$M$4<=18),O87&\"C\",0)","v":0},null,null,0,0,{"$f":"IF(AND(T87=20,$R$4>=15,$R$4<=18),T87&\"C\",0)","v":0},null,null,null,null,null,null,null,null,null,0,{"$f":"IF(AND($AE$4<=32,$AE$4>30),32,0)","v":0},{"$f":"IF(AND(AF87=32,$AD$4>=8,$AD$4<=14),AF87&\"A\",0)","v":0},null,null,0,{"$f":"IF(AND($AJ$4<=32,$AJ$4>30),32,0)","v":0},{"$f":"IF(AND(AK87=32,$AI$4>=8,$AI$4<=14),AK87&\"A\",0)","v":0}]
[null,null,null,null,null,null,null,null,null,null,null,null,null,0,0,{"$f":"IF(AND(O88=20,$M$4>=19,$M$4<=22),O88&\"D\",0)","v":0},null,null,0,0,{"$f":"IF(AND(T88=20,$R$4>=19,$R$4<=22),T88&\"D\",0)","v":0},null,null,null,null,null,null,null,null,null,0,0,{"$f":"IF(AND(AF88=32,$AD$4>=15,$AD$4<=20),AF88&\"B\",0)","v":0},null,null,0,0,{"$f":"IF(AND(AK88=32,$AI$4>=15,$AI$4<=20),AK88&\"B\",0)","v":0}]
[null,null,null,null,null,null,null,null,null,null,null,null,null,0,0,{"$f":"IF(AND(O89=20,$M$4>=23,$M$4<=26),O89&\"E\",0)","v":0},null,null,0,0,{"$f":"IF(AND(T89=20,$R$4>=23,$R$4<=26),T89&\"E\",0)","v":0},null,null,null,null,null,null,null,null,null,0,0,{"$f":"IF(AND(AF89=32,$AD$4>=21,$AD$4<=25),AF89&\"C\",0)","v":0},null,null,0,0,{"$f":"IF(AND(AK89=32,$AI$4>=21,$AI$4<=25),AK89&\"C\",0)","v":0}]
[null,null,null,null,null,null,null,null,null,null,null,null,null,0,0,{"$f":"IF(AND(O90=20,$M$4>=27,$M$4<=30),O90&\"F\",0)","v":0},null,null,0,0,{"$f":"IF(AND(T90=20,$R$4>=27,$R$4<=30),T90&\"F\",0)","v":0},null,null,null,null,null,null,null,null,null,0,0,{"$f":"IF(AND(AF90=32,$AD$4>=26,$AD$4<=30),AF90&\"D\",0)","v":0},null,null,0,0,{"$f":"IF(AND(AK90=32,$AI$4>=26,$AI$4<=30),AK90&\"D\",0)","v":0}]
[null,null,null,null,null,null,null,null,null,null,null,null,null,0,0,{"$f":"IF(AND(O91=20,$M$4>=31,$M$4<=34),O91&\"G\",0)","v":0},null,null,0,0,{"$f":"IF(AND(T91=20,$R$4>=31,$R$4<=34),T91&\"G\",0)","v":0},null,null,null,null,null,null,null,null,null,0,0,{"$f":"IF(AND(AF91=32,$AD$4>=31,$AD$4<=34),AF91&\"E\",0)","v":0},null,null,0,0,{"$f":"IF(AND(AK91=32,$AI$4>=31,$AI$4<=34),AK91&\"E\",0)","v":0}]
[null,null,null,null,null,null,null,null,null,null,null,null,null,0,0,{"$f":"IF(AND(O92=20,$M$4>=35,$M$4<=37),O92&\"H\",0)","v":0},null,null,0,0,{"$f":"IF(AND(T92=20,$R$4>=35,$R$4<=37),T92&\"H\",0)","v":0},null,null,null,null,null,null,null,null,null,0,0,{"$f":"IF(AND(AF92=32,$AD$4>=35,$AD$4<=37),AF92&\"F\",0)","v":0},null,null,0,0,{"$f":"IF(AND(AK92=32,$AI$4>=35,$AI$4<=37),AK92&\"F\",0)","v":0}]
[null,null,null,null,null,null,null,null,null,null,null,null,null,0,0,{"$f":"IF(AND(O93=20,$M$4>=38,$M$4<=40),O93&\"I\",0)","v":0},null,null,0,0,{"$f":"IF(AND(T93=20,$R$4>=38,$R$4<=40),T93&\"I\",0)","v":0},null,null,null,null,null,null,null,null,null,0,0,{"$f":"IF(AND(AF93=32,$AD$4>=38,$AD$4<=40),AF93&\"G\",0)","v":0},null,null,0,0,{"$f":"IF(AND(AK93=32,$AI$4>=38,$AI$4<=40),AK93&\"G\",0)","v":0}]
[null,null,null,null,null,null,null,null,null,null,null,null,null,0,0,{"$f":"IF(AND(O94=20,$M$4>=41,$M$4<=44),\"Dbl.\"&O94&\"D\",0)","v":0},null,null,0,0,{"$f":"IF(AND(T94=20,$R$4>=41,$R$4<=44),\"Dbl.\"&T94&\"D\",0)","v":0},null,null,null,null,null,null,null,null,null,0,0,{"$f":"IF(AND(AF94=32,$AD$4>=41,$AD$4<=43),AF94&\"H\",0)","v":0},null,null,0,0,{"$f":"IF(AND(AK94=32,$AI$4>=41,$AI$4<=43),AK94&\"H\",0)","v":0}]
[null,null,null,null,null,null,null,null,null,null,null,null,null,0,0,{"$f":"IF(AND(O95=20,$M$4>=45,$M$4<=52),\"Dbl.\"&O95&\"E\",0)","v":0},null,null,0,0,{"$f":"IF(AND(T95=20,$R$4>=45,$R$4<=52),\"Dbl.\"&T95&\"E\",0)","v":0},null,null,null,null,null,null,null,null,null,0,0,{"$f":"IF(AND(AF95=32,$AD$4>=44,$AD$4<=45),AF95&\"I\",0)","v":0},null,null,0,0,{"$f":"IF(AND(AK95=32,$AI$4>=44,$AI$4<=45),AK95&\"I\",0)","v":0}]
[null,null,null,null,null,null,null,null,null,null,null,null,null,0,0,{"$f":"IF(AND(O96=20,$M$4>=53,$M$4<=60),\"Dbl.\"&O96&\"F\",0)","v":0},null,null,0,0,{"$f":"IF(AND(T96=20,$R$4>=53,$R$4<=60),\"Dbl.\"&T96&\"F\",0)","v":0},null,null,null,null,null,null,null,null,null,0,{"$f":"IF(AND($AE$4<=34,$AE$4>32),34,0)","v":0},{"$f":"IF(AND(AF96=34,$AD$4>=11,$AD$4<=16),AF96&\"A\",0)","v":0},null,null,0,{"$f":"IF(AND($AJ$4<=34,$AJ$4>32),34,0)","v":0},{"$f":"IF(AND(AK96=34,$AI$4>=11,$AI$4<=16),AK96&\"A\",0)","v":0}]
[null,null,null,null,null,null,null,null,null,null,null,null,null,0,0,{"$f":"IF(AND(O97=20,$M$4>=61,$M$4<=68),\"Dbl.\"&O97&\"G\",0)","v":0},null,null,0,0,{"$f":"IF(AND(T97=20,$R$4>=61,$R$4<=68),\"Dbl.\"&T97&\"G\",0)","v":0},null,null,null,null,null,null,null,null,null,0,0,{"$f":"IF(AND(AF97=34,$AD$4>=17,$AD$4<=22),AF97&\"B\",0)","v":0},null,null,0,0,{"$f":"IF(AND(AK97=34,$AI$4>=17,$AI$4<=22),AK97&\"B\",0)","v":0}]
[null,null,null,null,null,null,null,null,null,null,null,null,null,0,0,{"$f":"IF(AND(O98=20,$M$4>=69,$M$4<=74),\"Dbl.\"&O98&\"H\",0)","v":0},null,null,0,0,{"$f":"IF(AND(T98=20,$R$4>=69,$R$4<=74),\"Dbl.\"&T98&\"H\",0)","v":0},null,null,null,null,null,null,null,null,null,0,0,{"$f":"IF(AND(AF98=34,$AD$4>=23,$AD$4<=27),AF98&\"C\",0)","v":0},null,null,0,0,{"$f":"IF(AND(AK98=34,$AI$4>=23,$AI$4<=27),AK98&\"C\",0)","v":0}]
[null,null,null,null,null,null,null,null,null,null,null,null,null,0,0,{"$f":"IF(AND(O99=20,$M$4>=75,$M$4<=80),\"Dbl.\"&O99&\"I\",0)","v":0},null,null,0,0,{"$f":"IF(AND(T99=20,$R$4>=75,$R$4<=80),\"Dbl.\"&T99&\"I\",0)","v":0},null,null,null,null,null,null,null,null,null,0,0,{"$f":"IF(AND(AF99=34,$AD$4>=28,$AD$4<=32),AF99&\"D\",0)","v":0},null,null,0,0,{"$f":"IF(AND(AK99=34,$AI$4>=28,$AI$4<=32),AK99&\"D\",0)","v":0}]
[null,null,null,null,null,null,null,null,null,null,null,null,null,0,{"$f":"IF(AND($N$4<=22,$N$4>20),22,0)","v":0},{"$f":"IF(AND(O100=22,$M$4>=5,$M$4<=10),O100&\"A\",0)","v":0},null,null,0,{"$f":"IF(AND($S$4<=22,$S$4>20),22,0)","v":0},{"$f":"IF(AND(T100=22,$R$4>=5,$R$4<=10),T100&\"A\",0)","v":0},null,null,null,null,null,null,null,null,null,0,0,{"$f":"IF(AND(AF100=34,$AD$4>=33,$AD$4<=34),AF100&\"E\",0)","v":0},null,null,0,0,{"$f":"IF(AND(AK100=34,$AI$4>=33,$AI$4<=34),AK100&\"E\",0)","v":0}]
[null,null,null,null,null,null,null,null,null,null,null,null,null,{"$f":"IF(AND(O101>0,P101>0),O101,0)","v":0},0,{"$f":"IF(AND(O101=22,$M$4>=11,$M$4<=16),O101&\"B\",0)","v":0},null,null,0,0,{"$f":"IF(AND(T101=22,$R$4>=11,$R$4<=16),T101&\"B\",0)","v":0},null,null,null,null,null,null,null,null,null,0,0,{"$f":"IF(AND(AF101=34,$AD$4>=35,$AD$4<=37),AF101&\"F\",0)","v":0},null,null,0,0,{"$f":"IF(AND(AK101=34,$AI$4>=35,$AI$4<=37),AK101&\"F\",0)","v":0}]
[null,null,null,null,null,null,null,null,null,null,null,null,null,0,0,{"$f":"IF(AND(O102=22,$M$4>=17,$M$4<=21),O102&\"C\",0)","v":0},null,null,0,0,{"$f":"IF(AND(T102=22,$R$4>=17,$R$4<=21),T102&\"C\",0)","v":0},null,null,null,null,null,null,null,null,null,0,0,{"$f":"IF(AND(AF102=34,$AD$4>=38,$AD$4<=40),AF102&\"G\",0)","v":0},null,null,0,0,{"$f":"IF(AND(AK102=34,$AI$4>=38,$AI$4<=40),AK102&\"G\",0)","v":0}]
[null,null,null,null,null,null,null,null,null,null,null,null,null,0,0,{"$f":"IF(AND(O103=22,$M$4>=22,$M$4<=24),O103&\"D\",0)","v":0},null,null,0,0,{"$f":"IF(AND(T103=22,$R$4>=22,$R$4<=24),T103&\"D\",0)","v":0},null,null,null,null,null,null,null,null,null,0,0,{"$f":"IF(AND(AF103=34,$AD$4>=41,$AD$4<=43),AF103&\"H\",0)","v":0},null,null,0,0,{"$f":"IF(AND(AK103=34,$AI$4>=41,$AI$4<=43),AK103&\"H\",0)","v":0}]
[null,null,null,null,null,null,null,null,null,null,null,null,null,0,0,{"$f":"IF(AND(O104=22,$M$4>=25,$M$4<=27),O104&\"E\",0)","v":0},null,null,0,0,{"$f":"IF(AND(T104=22,$R$4>=25,$R$4<=27),T104&\"E\",0)","v":0},null,null,null,null,null,null,null,null,null,0,0,{"$f":"IF(AND(AF104=34,$AD$4>=44,$AD$4<=45),AF104&\"I\",0)","v":0},null,null,0,0,{"$f":"IF(AND(AK104=34,$AI$4>=44,$AI$4<=45),AK104&\"I\",0)","v":0}]
[null,null,null,null,null,null,null,null,null,null,null,null,null,0,0,{"$f":"IF(AND(O105=22,$M$4>=28,$M$4<=30),O105&\"F\",0)","v":0},null,null,0,0,{"$f":"IF(AND(T105=22,$R$4>=28,$R$4<=30),T105&\"F\",0)","v":0},null,null,null,null,null,null,null,null,null,0,{"$f":"IF(AND($AE$4<=36,$AE$4>34),36,0)","v":0},{"$f":"IF(AND(AF105=36,$AD$4>=11,$AD$4<=16),AF105&\"A\",0)","v":0},null,null,0,{"$f":"IF(AND($AJ$4<=36,$AJ$4>34),36,0)","v":0},{"$f":"IF(AND(AK105=36,$AI$4>=11,$AI$4<=16),AK105&\"A\",0)","v":0}]
[null,null,null,null,null,null,null,null,null,null,null,null,null,0,0,{"$f":"IF(AND(O106=22,$M$4>=31,$M$4<=34),O106&\"G\",0)","v":0},null,null,0,0,{"$f":"IF(AND(T106=22,$R$4>=31,$R$4<=34),T106&\"G\",0)","v":0},null,null,null,null,null,null,null,null,null,0,0,{"$f":"IF(AND(AF106=36,$AD$4>=17,$AD$4<=22),AF106&\"B\",0)","v":0},null,null,0,0,{"$f":"IF(AND(AK106=36,$AI$4>=17,$AI$4<=22),AK106&\"B\",0)","v":0}]
[null,null,null,null,null,null,null,null,null,null,null,null,null,0,0,{"$f":"IF(AND(O107=22,$M$4>=35,$M$4<=37),O107&\"H\",0)","v":0},null,null,0,0,{"$f":"IF(AND(T107=22,$R$4>=35,$R$4<=37),T107&\"H\",0)","v":0},null,null,null,null,null,null,null,null,null,0,0,{"$f":"IF(AND(AF107=36,$AD$4>=23,$AD$4<=27),AF107&\"C\",0)","v":0},null,null,0,0,{"$f":"IF(AND(AK107=36,$AI$4>=23,$AI$4<=27),AK107&\"C\",0)","v":0}]
[null,null,null,null,null,null,null,null,null,null,null,null,null,0,0,{"$f":"IF(AND(O108=22,$M$4>=38,$M$4<=40),O108&\"I\",0)","v":0},null,null,0,0,{"$f":"IF(AND(T108=22,$R$4>=38,$R$4<=40),T108&\"I\",0)","v":0},null,null,null,null,null,null,null,null,null,0,0,{"$f":"IF(AND(AF108=36,$AD$4>=28,$AD$4<=32),AF108&\"D\",0)","v":0},null,null,0,0,{"$f":"IF(AND(AK108=36,$AI$4>=28,$AI$4<=32),AK108&\"D\",0)","v":0}]
[null,null,null,null,null,null,null,null,null,null,null,null,null,0,0,{"$f":"IF(AND(O109=22,$M$4>=41,$M$4<=42),\"Dbl.\"&O109&\"C\",0)","v":0},null,null,0,0,{"$f":"IF(AND(T109=22,$R$4>=41,$R$4<=42),\"Dbl.\"&T109&\"C\",0)","v":0},null,null,null,null,null,null,null,null,null,0,0,{"$f":"IF(AND(AF109=36,$AD$4>=33,$AD$4<=34),AF109&\"E\",0)","v":0},null,null,0,0,{"$f":"IF(AND(AK109=36,$AI$4>=33,$AI$4<=34),AK109&\"E\",0)","v":0}]
[null,null,null,null,null,null,null,null,null,null,null,null,null,0,0,{"$f":"IF(AND(O110=22,$M$4>=43,$M$4<=48),\"Dbl.\"&O110&\"D\",0)","v":0},null,null,0,0,{"$f":"IF(AND(T110=22,$R$4>=43,$R$4<=48),\"Dbl.\"&T110&\"D\",0)","v":0},null,null,null,null,null,null,null,null,null,0,0,{"$f":"IF(AND(AF110=36,$AD$4>=35,$AD$4<=37),AF110&\"F\",0)","v":0},null,null,0,0,{"$f":"IF(AND(AK110=36,$AI$4>=35,$AI$4<=37),AK110&\"F\",0)","v":0}]
[null,null,null,null,null,null,null,null,null,null,null,null,null,0,0,{"$f":"IF(AND(O111=22,$M$4>=49,$M$4<=54),\"Dbl.\"&O111&\"E\",0)","v":0},null,null,0,0,{"$f":"IF(AND(T111=22,$R$4>=49,$R$4<=54),\"Dbl.\"&T111&\"E\",0)","v":0},null,null,null,null,null,null,null,null,null,0,0,{"$f":"IF(AND(AF111=36,$AD$4>=38,$AD$4<=40),AF111&\"G\",0)","v":0},null,null,0,0,{"$f":"IF(AND(AK111=36,$AI$4>=38,$AI$4<=40),AK111&\"G\",0)","v":0}]
[null,null,null,null,null,null,null,null,null,null,null,null,null,0,0,{"$f":"IF(AND(O112=22,$M$4>=55,$M$4<=60),\"Dbl.\"&O112&\"F\",0)","v":0},null,null,0,0,{"$f":"IF(AND(T112=22,$R$4>=55,$R$4<=60),\"Dbl.\"&T112&\"F\",0)","v":0},null,null,null,null,null,null,null,null,null,0,0,{"$f":"IF(AND(AF112=36,$AD$4>=41,$AD$4<=43),AF112&\"H\",0)","v":0},null,null,0,0,{"$f":"IF(AND(AK112=36,$AI$4>=41,$AI$4<=43),AK112&\"H\",0)","v":0}]
[null,null,null,null,null,null,null,null,null,null,null,null,null,0,0,{"$f":"IF(AND(O113=22,$M$4>=61,$M$4<=68),\"Dbl.\"&O113&\"G\",0)","v":0},null,null,0,0,{"$f":"IF(AND(T113=22,$R$4>=61,$R$4<=68),\"Dbl.\"&T113&\"G\",0)","v":0},null,null,null,null,null,null,null,null,null,0,0,{"$f":"IF(AND(AF113=36,$AD$4>=44,$AD$4<=45),AF113&\"I\",0)","v":0},null,null,0,0,{"$f":"IF(AND(AK113=36,$AI$4>=44,$AI$4<=45),AK113&\"I\",0)","v":0}]
[null,null,null,null,null,null,null,null,null,null,null,null,null,0,0,{"$f":"IF(AND(O114=22,$M$4>=69,$M$4<=74),\"Dbl.\"&O114&\"H\",0)","v":0},null,null,0,0,{"$f":"IF(AND(T114=22,$R$4>=69,$R$4<=74),\"Dbl.\"&T114&\"H\",0)","v":0},null,null,null,null,null,null,null,null,null,0,{"$f":"IF(AND($AE$4<=38,$AE$4>36),38,0)","v":0},{"$f":"IF(AND(AF114=38,$AD$4>=11,$AD$4<=16),AF114&\"A\",0)","v":0},null,null,0,{"$f":"IF(AND($AJ$4<=38,$AJ$4>36),38,0)","v":0},{"$f":"IF(AND(AK114=38,$AI$4>=11,$AI$4<=16),AK114&\"A\",0)","v":0}]
[null,null,null,null,null,null,null,null,null,null,null,null,null,0,0,{"$f":"IF(AND(O115=22,$M$4>=75,$M$4<=80),\"Dbl.\"&O115&\"I\",0)","v":0},null,null,0,0,{"$f":"IF(AND(T115=22,$R$4>=75,$R$4<=80),\"Dbl.\"&T115&\"I\",0)","v":0},null,null,null,null,null,null,null,null,null,0,0,{"$f":"IF(AND(AF115=38,$AD$4>=17,$AD$4<=22),AF115&\"B\",0)","v":0},null,null,0,0,{"$f":"IF(AND(AK115=38,$AI$4>=17,$AI$4<=22),AK115&\"B\",0)","v":0}]
[null,null,null,null,null,null,null,null,null,null,null,null,null,0,{"$f":"IF(AND($N$4<=24,$N$4>22),24,0)","v":0},{"$f":"IF(AND(O116=24,$M$4>=6,$M$4<=10),O116&\"A\",0)","v":0},null,null,0,{"$f":"IF(AND($S$4<=24,$S$4>22),24,0)","v":0},{"$f":"IF(AND(T116=24,$R$4>=6,$R$4<=10),T116&\"A\",0)","v":0},null,null,null,null,null,null,null,null,null,0,0,{"$f":"IF(AND(AF116=38,$AD$4>=23,$AD$4<=27),AF116&\"C\",0)","v":0},null,null,0,0,{"$f":"IF(AND(AK116=38,$AI$4>=23,$AI$4<=27),AK116&\"C\",0)","v":0}]
[null,null,null,null,null,null,null,null,null,null,null,null,null,0,0,{"$f":"IF(AND(O117=24,$M$4>=11,$M$4<=17),O117&\"B\",0)","v":0},null,null,0,0,{"$f":"IF(AND(T117=24,$R$4>=11,$R$4<=17),T117&\"B\",0)","v":0},null,null,null,null,null,null,null,null,null,0,0,{"$f":"IF(AND(AF117=38,$AD$4>=28,$AD$4<=32),AF117&\"D\",0)","v":0},null,null,0,0,{"$f":"IF(AND(AK117=38,$AI$4>=28,$AI$4<=32),AK117&\"D\",0)","v":0}]
[null,null,null,null,null,null,null,null,null,null,null,null,null,0,0,{"$f":"IF(AND(O118=24,$M$4>=18,$M$4<=22),O118&\"C\",0)","v":0},null,null,0,0,{"$f":"IF(AND(T118=24,$R$4>=18,$R$4<=22),T118&\"C\",0)","v":0},null,null,null,null,null,null,null,null,null,0,0,{"$f":"IF(AND(AF118=38,$AD$4>=33,$AD$4<=34),AF118&\"E\",0)","v":0},null,null,0,0,{"$f":"IF(AND(AK118=38,$AI$4>=33,$AI$4<=34),AK118&\"E\",0)","v":0}]
[null,null,null,null,null,null,null,null,null,null,null,null,null,0,0,{"$f":"IF(AND(O119=24,$M$4>=23,$M$4<=25),O119&\"D\",0)","v":0},null,null,0,0,{"$f":"IF(AND(T119=24,$R$4>=23,$R$4<=25),T119&\"D\",0)","v":0},null,null,null,null,null,null,null,null,null,0,0,{"$f":"IF(AND(AF119=38,$AD$4>=35,$AD$4<=37),AF119&\"F\",0)","v":0},null,null,0,0,{"$f":"IF(AND(AK119=38,$AI$4>=35,$AI$4<=37),AK119&\"F\",0)","v":0}]
[null,null,null,null,null,null,null,null,null,null,null,null,null,0,0,{"$f":"IF(AND(O120=24,$M$4>=26,$M$4<=28),O120&\"E\",0)","v":0},null,null,0,0,{"$f":"IF(AND(T120=24,$R$4>=26,$R$4<=28),T120&\"E\",0)","v":0},null,null,null,null,null,null,null,null,null,0,0,{"$f":"IF(AND(AF120=38,$AD$4>=38,$AD$4<=40),AF120&\"G\",0)","v":0},null,null,0,0,{"$f":"IF(AND(AK120=38,$AI$4>=38,$AI$4<=40),AK120&\"G\",0)","v":0}]
[null,null,null,null,null,null,null,null,null,null,null,null,null,0,0,{"$f":"IF(AND(O121=24,$M$4>=29,$M$4<=30),O121&\"F\",0)","v":0},null,null,0,0,{"$f":"IF(AND(T121=24,$R$4>=29,$R$4<=30),T121&\"F\",0)","v":0},null,null,null,null,null,null,null,null,null,0,0,{"$f":"IF(AND(AF121=38,$AD$4>=41,$AD$4<=43),AF121&\"H\",0)","v":0},null,null,0,0,{"$f":"IF(AND(AK121=38,$AI$4>=41,$AI$4<=43),AK121&\"H\",0)","v":0}]
[null,null,null,null,null,null,null,null,null,null,null,null,null,0,0,{"$f":"IF(AND(O122=24,$M$4>=31,$M$4<=34),O122&\"G\",0)","v":0},null,null,0,0,{"$f":"IF(AND(T122=24,$R$4>=31,$R$4<=34),T122&\"G\",0)","v":0},null,null,null,null,null,null,null,null,null,0,0,{"$f":"IF(AND(AF122=38,$AD$4>=44,$AD$4<=45),AF122&\"I\",0)","v":0},null,null,0,0,{"$f":"IF(AND(AK122=38,$AI$4>=44,$AI$4<=45),AK122&\"I\",0)","v":0}]
[null,null,null,null,null,null,null,null,null,null,null,null,null,0,0,{"$f":"IF(AND(O123=24,$M$4>=35,$M$4<=37),O123&\"H\",0)","v":0},null,null,0,0,{"$f":"IF(AND(T123=24,$R$4>=35,$R$4<=37),T123&\"H\",0)","v":0},null,null,null,null,null,null,null,null,null,0,{"$f":"IF(AND($AE$4<=40,$AE$4>38),40,0)","v":0},{"$f":"IF(AND(AF123=40,$AD$4>=11,$AD$4<=16),AF123&\"A\",0)","v":0},null,null,0,{"$f":"IF(AND($AJ$4<=40,$AJ$4>38),40,0)","v":0},{"$f":"IF(AND(AK123=40,$AI$4>=11,$AI$4<=16),AK123&\"A\",0)","v":0}]
[null,null,null,null,null,null,null,null,null,null,null,null,null,0,0,{"$f":"IF(AND(O124=24,$M$4>=38,$M$4<=40),O124&\"I\",0)","v":0},null,null,0,0,{"$f":"IF(AND(T124=24,$R$4>=38,$R$4<=40),T124&\"I\",0)","v":0},null,null,null,null,null,null,null,null,null,0,0,{"$f":"IF(AND(AF124=40,$AD$4>=17,$AD$4<=22),AF124&\"B\",0)","v":0},null,null,0,0,{"$f":"IF(AND(AK124=40,$AI$4>=17,$AI$4<=22),AK124&\"B\",0)","v":0}]
[null,null,null,null,null,null,null,null,null,null,null,null,null,{"$f":"IF(AND(O125>0,P125>0),O125,0)","v":0},0,{"$f":"IF(AND(O125=24,$M$4>=41,$M$4<=44),\"Dbl.\"&O125&\"C\",0)","v":0},null,null,0,0,{"$f":"IF(AND(T125=24,$R$4>=41,$R$4<=44),\"Dbl.\"&T125&\"C\",0)","v":0},null,null,null,null,null,null,null,null,null,0,0,{"$f":"IF(AND(AF125=40,$AD$4>=23,$AD$4<=27),AF125&\"C\",0)","v":0},null,null,0,0,{"$f":"IF(AND(AK125=40,$AI$4>=23,$AI$4<=27),AK125&\"C\",0)","v":0}]
[null,null,null,null,null,null,null,null,null,null,null,null,null,0,0,{"$f":"IF(AND(O126=24,$M$4>=45,$M$4<=50),\"Dbl.\"&O126&\"D\",0)","v":0},null,null,0,0,{"$f":"IF(AND(T126=24,$R$4>=45,$R$4<=50),\"Dbl.\"&T126&\"D\",0)","v":0},null,null,null,null,null,null,null,null,null,0,0,{"$f":"IF(AND(AF126=40,$AD$4>=28,$AD$4<=32),AF126&\"D\",0)","v":0},null,null,0,0,{"$f":"IF(AND(AK126=40,$AI$4>=28,$AI$4<=32),AK126&\"D\",0)","v":0}]
[null,null,null,null,null,null,null,null,null,null,null,null,null,0,0,{"$f":"IF(AND(O127=24,$M$4>=51,$M$4<=56),\"Dbl.\"&O127&\"E\",0)","v":0},null,null,0,0,{"$f":"IF(AND(T127=24,$R$4>=51,$R$4<=56),\"Dbl.\"&T127&\"E\",0)","v":0},null,null,null,null,null,null,null,null,null,0,0,{"$f":"IF(AND(AF127=40,$AD$4>=33,$AD$4<=34),AF127&\"E\",0)","v":0},null,null,0,0,{"$f":"IF(AND(AK127=40,$AI$4>=33,$AI$4<=34),AK127&\"E\",0)","v":0}]
[null,null,null,null,null,null,null,null,null,null,null,null,null,0,0,{"$f":"IF(AND(O128=24,$M$4>=57,$M$4<=60),\"Dbl.\"&O128&\"F\",0)","v":0},null,null,0,0,{"$f":"IF(AND(T128=24,$R$4>=57,$R$4<=60),\"Dbl.\"&T128&\"F\",0)","v":0},null,null,null,null,null,null,null,null,null,0,0,{"$f":"IF(AND(AF128=40,$AD$4>=35,$AD$4<=37),AF128&\"F\",0)","v":0},null,null,0,0,{"$f":"IF(AND(AK128=40,$AI$4>=35,$AI$4<=37),AK128&\"F\",0)","v":0}]
[null,null,null,null,null,null,null,null,null,null,null,null,null,0,0,{"$f":"IF(AND(O129=24,$M$4>=61,$M$4<=68),\"Dbl.\"&O129&\"G\",0)","v":0},null,null,0,0,{"$f":"IF(AND(T129=24,$R$4>=61,$R$4<=68),\"Dbl.\"&T129&\"G\",0)","v":0},null,null,null,null,null,null,null,null,null,0,0,{"$f":"IF(AND(AF129=40,$AD$4>=38,$AD$4<=40),AF129&\"G\",0)","v":0},null,null,0,0,{"$f":"IF(AND(AK129=40,$AI$4>=38,$AI$4<=40),AK129&\"G\",0)","v":0}]
[null,null,null,null,null,null,null,null,null,null,null,null,null,0,0,{"$f":"IF(AND(O130=24,$M$4>=69,$M$4<=74),\"Dbl.\"&O130&\"H\",0)","v":0},null,null,0,0,{"$f":"IF(AND(T130=24,$R$4>=69,$R$4<=74),\"Dbl.\"&T130&\"H\",0)","v":0},null,null,null,null,null,null,null,null,null,0,0,{"$f":"IF(AND(AF130=40,$AD$4>=41,$AD$4<=42),AF130&\"H\",0)","v":0},null,null,0,0,{"$f":"IF(AND(AK130=40,$AI$4>=41,$AI$4<=42),AK130&\"H\",0)","v":0}]
[null,null,null,null,null,null,null,null,null,null,null,null,null,0,0,{"$f":"IF(AND(O131=24,$M$4>=75,$M$4<=80),\"Dbl.\"&O131&\"I\",0)","v":0},null,null,0,0,{"$f":"IF(AND(T131=24,$R$4>=75,$R$4<=80),\"Dbl.\"&T131&\"I\",0)","v":0},null,null,null,null,null,null,null,null,null,0,0,{"$f":"IF(AND(AF131=40,$AD$4>=43,$AD$4<=45),AF131&\"I\",0)","v":0},null,null,0,0,{"$f":"IF(AND(AK131=40,$AI$4>=43,$AI$4<=45),AK131&\"I\",0)","v":0}]
[null,null,null,null,null,null,null,null,null,null,null,null,null,{"$f":"IF(AND(O132>0,P132>0),O132,0)","v":0},{"$f":"IF(AND($N$4<=26,$N$4>24),26,0)","v":0},{"$f":"IF(AND(O132=26,$M$4>=6,$M$4<=11),O132&\"A\",0)","v":0},null,null,0,{"$f":"IF(AND($S$4<=26,$S$4>24),26,0)","v":0},{"$f":"IF(AND(T132=26,$R$4>=6,$R$4<=11),T132&\"A\",0)","v":0},null,null,null,null,null,null,null,null,null,0,{"$f":"IF(AND($AE$4<=42,$AE$4>40),42,0)","v":0},{"$f":"IF(AND(AF132=42,$AD$4>=11,$AD$4<=16),AF132&\"A\",0)","v":0},null,null,0,{"$f":"IF(AND($AJ$4<=42,$AJ$4>40),42,0)","v":0},{"$f":"IF(AND(AK132=42,$AI$4>=11,$AI$4<=16),AK132&\"A\",0)","v":0}]
[null,null,null,null,null,null,null,null,null,null,null,null,null,0,0,{"$f":"IF(AND(O133=26,$M$4>=12,$M$4<=17),O133&\"B\",0)","v":0},null,null,{"$f":"IF(AND(T133>0,U133>0),T133,0)","v":0},0,{"$f":"IF(AND(T133=26,$R$4>=12,$R$4<=17),T133&\"B\",0)","v":0},null,null,null,null,null,null,null,null,null,{"$f":"IF(AND(AF133>0,AG133>0),AF133,0)","v":0},0,{"$f":"IF(AND(AF133=42,$AD$4>=17,$AD$4<=22),AF133&\"B\",0)","v":0},null,null,{"$f":"IF(AND(AK133>0,AL133>0),AK133,0)","v":0},0,{"$f":"IF(AND(AK133=42,$AI$4>=17,$AI$4<=22),AK133&\"B\",0)","v":0}]
[null,null,null,null,null,null,null,null,null,null,null,null,null,0,0,{"$f":"IF(AND(O134=26,$M$4>=18,$M$4<=22),O134&\"C\",0)","v":0},null,null,0,0,{"$f":"IF(AND(T134=26,$R$4>=18,$R$4<=22),T134&\"C\",0)","v":0},null,null,null,null,null,null,null,null,null,0,0,{"$f":"IF(AND(AF134=42,$AD$4>=23,$AD$4<=27),AF134&\"C\",0)","v":0},null,null,0,0,{"$f":"IF(AND(AK134=42,$AI$4>=23,$AI$4<=27),AK134&\"C\",0)","v":0}]
[null,null,null,null,null,null,null,null,null,null,null,null,null,0,0,{"$f":"IF(AND(O135=26,$M$4>=23,$M$4<=26),O135&\"D\",0)","v":0},null,null,0,0,{"$f":"IF(AND(T135=26,$R$4>=23,$R$4<=26),T135&\"D\",0)","v":0},null,null,null,null,null,null,null,null,null,0,0,{"$f":"IF(AND(AF135=42,$AD$4>=28,$AD$4<=31),AF135&\"D\",0)","v":0},null,null,0,0,{"$f":"IF(AND(AK135=42,$AI$4>=28,$AI$4<=31),AK135&\"D\",0)","v":0}]
[null,null,null,null,null,null,null,null,null,null,null,null,null,0,0,{"$f":"IF(AND(O136=26,$M$4>=27,$M$4<=30),O136&\"E\",0)","v":0},null,null,0,0,{"$f":"IF(AND(T136=26,$R$4>=27,$R$4<=30),T136&\"E\",0)","v":0},null,null,null,null,null,null,null,null,null,0,0,{"$f":"IF(AND(AF136=42,$AD$4>=32,$AD$4<=34),AF136&\"E\",0)","v":0},null,null,0,0,{"$f":"IF(AND(AK136=42,$AI$4>=32,$AI$4<=34),AK136&\"E\",0)","v":0}]
[null,null,null,null,null,null,null,null,null,null,null,null,null,0,0,{"$f":"IF(AND(O137=26,$M$4>=31,$M$4<=34),O137&\"F\",0)","v":0},null,null,0,0,{"$f":"IF(AND(T137=26,$R$4>=31,$R$4<=34),T137&\"F\",0)","v":0},null,null,null,null,null,null,null,null,null,0,0,{"$f":"IF(AND(AF137=42,$AD$4>=35,$AD$4<=37),AF137&\"F\",0)","v":0},null,null,0,0,{"$f":"IF(AND(AK137=42,$AI$4>=35,$AI$4<=37),AK137&\"F\",0)","v":0}]
[null,null,null,null,null,null,null,null,null,null,null,null,null,0,0,{"$f":"IF(AND(O138=26,$M$4>=35,$M$4<=38),O138&\"G\",0)","v":0},null,null,0,0,{"$f":"IF(AND(T138=26,$R$4>=35,$R$4<=38),T138&\"G\",0)","v":0},null,null,null,null,null,null,null,null,null,0,0,{"$f":"IF(AND(AF138=42,$AD$4>=38,$AD$4<=40),AF138&\"G\",0)","v":0},null,null,0,0,{"$f":"IF(AND(AK138=42,$AI$4>=38,$AI$4<=40),AK138&\"G\",0)","v":0}]
[null,null,null,null,null,null,null,null,null,null,null,null,null,0,0,{"$f":"IF(AND(O139=26,$M$4>=39,$M$4<=42),O139&\"H\",0)","v":0},null,null,0,0,{"$f":"IF(AND(T139=26,$R$4>=39,$R$4<=42),T139&\"H\",0)","v":0},null,null,null,null,null,null,null,null,null,0,0,{"$f":"IF(AND(AF139=42,$AD$4>=41,$AD$4<=43),AF139&\"H\",0)","v":0},null,null,0,0,{"$f":"IF(AND(AK139=42,$AI$4>=41,$AI$4<=43),AK139&\"H\",0)","v":0}]
[null,null,null,null,null,null,null,null,null,null,null,null,null,0,0,{"$f":"IF(AND(O140=26,$M$4>=43,$M$4<=45),O140&\"I\",0)","v":0},null,null,0,0,{"$f":"IF(AND(T140=26,$R$4>=43,$R$4<=45),T140&\"I\",0)","v":0},null,null,null,null,null,null,null,null,null,0,0,{"$f":"IF(AND(AF140=42,$AD$4>=44,$AD$4<=45),AF140&\"I\",0)","v":0},null,null,0,0,{"$f":"IF(AND(AK140=42,$AI$4>=44,$AI$4<=45),AK140&\"I\",0)","v":0}]
[null,null,null,null,null,null,null,null,null,null,null,null,null,0,0,{"$f":"IF(AND(O141=26,$M$4>=46,$M$4<=52),\"Dbl.\"&O141&\"D\",0)","v":0},null,null,0,0,{"$f":"IF(AND(T141=26,$R$4>=46,$R$4<=52),\"Dbl.\"&T141&\"D\",0)","v":0},null,null,null,null,null,null,null,null,null,0,{"$f":"IF(AND($AE$4<=44,$AE$4>42),44,0)","v":0},{"$f":"IF(AND(AF141=44,$AD$4>=11,$AD$4<=16),AF141&\"A\",0)","v":0},null,null,0,{"$f":"IF(AND($AJ$4<=44,$AJ$4>42),44,0)","v":0},{"$f":"IF(AND(AK141=44,$AI$4>=11,$AI$4<=16),AK141&\"A\",0)","v":0}]
[null,null,null,null,null,null,null,null,null,null,null,null,null,0,0,{"$f":"IF(AND(O142=26,$M$4>=53,$M$4<=60),\"Dbl.\"&O142&\"E\",0)","v":0},null,null,0,0,{"$f":"IF(AND(T142=26,$R$4>=53,$R$4<=60),\"Dbl.\"&T142&\"E\",0)","v":0},null,null,null,null,null,null,null,null,null,0,0,{"$f":"IF(AND(AF142=44,$AD$4>=17,$AD$4<=22),AF142&\"B\",0)","v":0},null,null,0,0,{"$f":"IF(AND(AK142=44,$AI$4>=17,$AI$4<=22),AK142&\"B\",0)","v":0}]
[null,null,null,null,null,null,null,null,null,null,null,null,null,0,0,{"$f":"IF(AND(O143=26,$M$4>=61,$M$4<=68),\"Dbl.\"&O143&\"F\",0)","v":0},null,null,0,0,{"$f":"IF(AND(T143=26,$R$4>=61,$R$4<=68),\"Dbl.\"&T143&\"F\",0)","v":0},null,null,null,null,null,null,null,null,null,0,0,{"$f":"IF(AND(AF143=44,$AD$4>=23,$AD$4<=27),AF143&\"C\",0)","v":0},null,null,0,0,{"$f":"IF(AND(AK143=44,$AI$4>=23,$AI$4<=27),AK143&\"C\",0)","v":0}]
[null,null,null,null,null,null,null,null,null,null,null,null,null,0,0,{"$f":"IF(AND(O144=26,$M$4>=69,$M$4<=76),\"Dbl.\"&O144&\"G\",0)","v":0},null,null,0,0,{"$f":"IF(AND(T144=26,$R$4>=69,$R$4<=76),\"Dbl.\"&T144&\"G\",0)","v":0},null,null,null,null,null,null,null,null,null,0,0,{"$f":"IF(AND(AF144=44,$AD$4>=28,$AD$4<=32),AF144&\"D\",0)","v":0},null,null,0,0,{"$f":"IF(AND(AK144=44,$AI$4>=28,$AI$4<=32),AK144&\"D\",0)","v":0}]
[null,null,null,null,null,null,null,null,null,null,null,null,null,0,0,{"$f":"IF(AND(O145=26,$M$4>=77,$M$4<=80),\"Dbl.\"&O145&\"H\",0)","v":0},null,null,0,0,{"$f":"IF(AND(T145=26,$R$4>=77,$R$4<=80),\"Dbl.\"&T145&\"H\",0)","v":0},null,null,null,null,null,null,null,null,null,0,0,{"$f":"IF(AND(AF145=44,$AD$4>=33,$AD$4<=34),AF145&\"E\",0)","v":0},null,null,0,0,{"$f":"IF(AND(AK145=44,$AI$4>=33,$AI$4<=34),AK145&\"E\",0)","v":0}]
[null,null,null,null,null,null,null,null,null,null,null,null,null,0,{"$f":"IF(AND($N$4<=28,$N$4>26),28,0)","v":0},{"$f":"IF(AND(O146=28,$M$4>=7,$M$4<=12),O146&\"A\",0)","v":0},null,null,0,{"$f":"IF(AND($S$4<=28,$S$4>26),28,0)","v":0},{"$f":"IF(AND(T146=28,$R$4>=7,$R$4<=12),T146&\"A\",0)","v":0},null,null,null,null,null,null,null,null,null,0,0,{"$f":"IF(AND(AF146=44,$AD$4>=35,$AD$4<=37),AF146&\"F\",0)","v":0},null,null,0,0,{"$f":"IF(AND(AK146=44,$AI$4>=35,$AI$4<=37),AK146&\"F\",0)","v":0}]
[null,null,null,null,null,null,null,null,null,null,null,null,null,0,0,{"$f":"IF(AND(O147=28,$M$4>=13,$M$4<=18),O147&\"B\",0)","v":0},null,null,0,0,{"$f":"IF(AND(T147=28,$R$4>=13,$R$4<=18),T147&\"B\",0)","v":0},null,null,null,null,null,null,null,null,null,0,0,{"$f":"IF(AND(AF147=44,$AD$4>=38,$AD$4<=40),AF147&\"G\",0)","v":0},null,null,0,0,{"$f":"IF(AND(AK147=44,$AI$4>=38,$AI$4<=40),AK147&\"G\",0)","v":0}]
[null,null,null,null,null,null,null,null,null,null,null,null,null,0,0,{"$f":"IF(AND(O148=28,$M$4>=19,$M$4<=23),O148&\"C\",0)","v":0},null,null,0,0,{"$f":"IF(AND(T148=28,$R$4>=19,$R$4<=23),T148&\"C\",0)","v":0},null,null,null,null,null,null,null,null,null,0,0,{"$f":"IF(AND(AF148=44,$AD$4>=41,$AD$4<=43),AF148&\"H\",0)","v":0},null,null,0,0,{"$f":"IF(AND(AK148=44,$AI$4>=41,$AI$4<=43),AK148&\"H\",0)","v":0}]
[null,null,null,null,null,null,null,null,null,null,null,null,null,0,0,{"$f":"IF(AND(O149=28,$M$4>=24,$M$4<=28),O149&\"D\",0)","v":0},null,null,0,0,{"$f":"IF(AND(T149=28,$R$4>=24,$R$4<=28),T149&\"D\",0)","v":0},null,null,null,null,null,null,null,null,null,0,0,{"$f":"IF(AND(AF149=44,$AD$4>=44,$AD$4<=45),AF149&\"I\",0)","v":0},null,null,0,0,{"$f":"IF(AND(AK149=44,$AI$4>=44,$AI$4<=45),AK149&\"I\",0)","v":0}]
[null,null,null,null,null,null,null,null,null,null,null,null,null,0,0,{"$f":"IF(AND(O150=28,$M$4>=29,$M$4<=32),O150&\"E\",0)","v":0},null,null,0,0,{"$f":"IF(AND(T150=28,$R$4>=29,$R$4<=32),T150&\"E\",0)","v":0}]
[null,null,null,null,null,null,null,null,null,null,null,null,null,0,0,{"$f":"IF(AND(O151=28,$M$4>=33,$M$4<=36),O151&\"F\",0)","v":0},null,null,0,0,{"$f":"IF(AND(T151=28,$R$4>=33,$R$4<=36),T151&\"F\",0)","v":0}]
[null,null,null,null,null,null,null,null,null,null,null,null,null,0,0,{"$f":"IF(AND(O152=28,$M$4>=37,$M$4<=40),O152&\"G\",0)","v":0},null,null,0,0,{"$f":"IF(AND(T152=28,$R$4>=37,$R$4<=40),T152&\"G\",0)","v":0}]
[null,null,null,null,null,null,null,null,null,null,null,null,null,0,0,{"$f":"IF(AND(O153=28,$M$4>=41,$M$4<=43),O153&\"H\",0)","v":0},null,null,0,0,{"$f":"IF(AND(T153=28,$R$4>=41,$R$4<=43),T153&\"H\",0)","v":0}]
[null,null,null,null,null,null,null,null,null,null,null,null,null,0,0,{"$f":"IF(AND(O154=28,$M$4>=44,$M$4<=45),O154&\"I\",0)","v":0},null,null,0,0,{"$f":"IF(AND(T154=28,$R$4>=44,$R$4<=45),T154&\"I\",0)","v":0}]
[null,null,null,null,null,null,null,null,null,null,null,null,null,0,0,{"$f":"IF(AND(O155=28,$M$4=46),\"Dbl.\"&O155&\"C\",0)","v":0},null,null,0,0,{"$f":"IF(AND(T155=28,$R$4=46),\"Dbl.\"&T155&\"C\",0)","v":0}]
[null,null,null,null,null,null,null,null,null,null,null,null,null,0,0,{"$f":"IF(AND(O156=28,$M$4>=47,$M$4<=56),\"Dbl.\"&O156&\"D\",0)","v":0},null,null,0,0,{"$f":"IF(AND(T156=28,$R$4>=47,$R$4<=56),\"Dbl.\"&T156&\"D\",0)","v":0}]
[null,null,null,null,null,null,null,null,null,null,null,null,null,0,0,{"$f":"IF(AND(O157=28,$M$4>=57,$M$4<=64),\"Dbl.\"&O157&\"E\",0)","v":0},null,null,0,0,{"$f":"IF(AND(T157=28,$R$4>=57,$R$4<=64),\"Dbl.\"&T157&\"E\",0)","v":0}]
[null,null,null,null,null,null,null,null,null,null,null,null,null,0,0,{"$f":"IF(AND(O158=28,$M$4>=65,$M$4<=72),\"Dbl.\"&O158&\"F\",0)","v":0},null,null,0,0,{"$f":"IF(AND(T158=28,$R$4>=65,$R$4<=72),\"Dbl.\"&T158&\"F\",0)","v":0}]
[null,null,null,null,null,null,null,null,null,null,null,null,null,0,0,{"$f":"IF(AND(O159=28,$M$4>=73,$M$4<=80),\"Dbl.\"&O159&\"G\",0)","v":0},null,null,0,0,{"$f":"IF(AND(T159=28,$R$4>=73,$R$4<=80),\"Dbl.\"&T159&\"G\",0)","v":0}]
[null,null,null,null,null,null,null,null,null,null,null,null,null,0,{"$f":"IF(AND($N$4<=30,$N$4>28),30,0)","v":0},{"$f":"IF(AND(O160=30,$M$4>=8,$M$4<=13),O160&\"A\",0)","v":0},null,null,0,{"$f":"IF(AND($S$4<=30,$S$4>28),30,0)","v":0},{"$f":"IF(AND(T160=30,$R$4>=8,$R$4<=13),T160&\"A\",0)","v":0}]
[null,null,null,null,null,null,null,null,null,null,null,null,null,0,0,{"$f":"IF(AND(O161=30,$M$4>=14,$M$4<=19),O161&\"B\",0)","v":0},null,null,0,0,{"$f":"IF(AND(T161=30,$R$4>=14,$R$4<=19),T161&\"B\",0)","v":0}]
[null,null,null,null,null,null,null,null,null,null,null,null,null,0,0,{"$f":"IF(AND(O162=30,$M$4>=20,$M$4<=24),O162&\"C\",0)","v":0},null,null,0,0,{"$f":"IF(AND(T162=30,$R$4>=20,$R$4<=24),T162&\"C\",0)","v":0}]
[null,null,null,null,null,null,null,null,null,null,null,null,null,0,0,{"$f":"IF(AND(O163=30,$M$4>=25,$M$4<=29),O163&\"D\",0)","v":0},null,null,0,0,{"$f":"IF(AND(T163=30,$R$4>=25,$R$4<=29),T163&\"D\",0)","v":0}]
[null,null,null,null,null,null,null,null,null,null,null,null,null,{"$f":"IF(AND(O164>0,P164>0),O164,0)","v":0},0,{"$f":"IF(AND(O164=30,$M$4>=30,$M$4<=33),O164&\"E\",0)","v":0},null,null,0,0,{"$f":"IF(AND(T164=30,$R$4>=30,$R$4<=33),T164&\"E\",0)","v":0}]
[null,null,null,null,null,null,null,null,null,null,null,null,null,0,0,{"$f":"IF(AND(O165=30,$M$4>=34,$M$4<=37),O165&\"F\",0)","v":0},null,null,0,0,{"$f":"IF(AND(T165=30,$R$4>=34,$R$4<=37),T165&\"F\",0)","v":0}]
[null,null,null,null,null,null,null,null,null,null,null,null,null,0,0,{"$f":"IF(AND(O166=30,$M$4>=38,$M$4<=40),O166&\"G\",0)","v":0},null,null,0,0,{"$f":"IF(AND(T166=30,$R$4>=38,$R$4<=40),T166&\"G\",0)","v":0}]
[null,null,null,null,null,null,null,null,null,null,null,null,null,0,0,{"$f":"IF(AND(O167=30,$M$4>=41,$M$4<=43),O167&\"H\",0)","v":0},null,null,0,0,{"$f":"IF(AND(T167=30,$R$4>=41,$R$4<=43),T167&\"H\",0)","v":0}]
[null,null,null,null,null,null,null,null,null,null,null,null,null,0,0,{"$f":"IF(AND(O168=30,$M$4>=44,$M$4<=45),O168&\"I\",0)","v":0},null,null,0,0,{"$f":"IF(AND(T168=30,$R$4>=44,$R$4<=45),T168&\"I\",0)","v":0}]
[null,null,null,null,null,null,null,null,null,null,null,null,null,0,0,{"$f":"IF(AND(O169=30,$M$4>=46,$M$4<=48),\"Dbl.\"&O169&\"C\",0)","v":0},null,null,0,0,{"$f":"IF(AND(T169=30,$R$4>=46,$R$4<=48),\"Dbl.\"&T169&\"C\",0)","v":0}]
[null,null,null,null,null,null,null,null,null,null,null,null,null,0,0,{"$f":"IF(AND(O170=30,$M$4>=49,$M$4<=58),\"Dbl.\"&O170&\"D\",0)","v":0},null,null,0,0,{"$f":"IF(AND(T170=30,$R$4>=49,$R$4<=58),\"Dbl.\"&T170&\"D\",0)","v":0}]
[null,null,null,null,null,null,null,null,null,null,null,null,null,0,0,{"$f":"IF(AND(O171=30,$M$4>=59,$M$4<=66),\"Dbl.\"&O171&\"E\",0)","v":0},null,null,0,0,{"$f":"IF(AND(T171=30,$R$4>=59,$R$4<=66),\"Dbl.\"&T171&\"E\",0)","v":0}]
[null,null,null,null,null,null,null,null,null,null,null,null,null,0,0,{"$f":"IF(AND(O172=30,$M$4>=67,$M$4<=74),\"Dbl.\"&O172&\"F\",0)","v":0},null,null,0,0,{"$f":"IF(AND(T172=30,$R$4>=67,$R$4<=74),\"Dbl.\"&T172&\"F\",0)","v":0}]
[null,null,null,null,null,null,null,null,null,null,null,null,null,0,0,{"$f":"IF(AND(O173=30,$M$4>=75,$M$4<=80),\"Dbl.\"&O173&\"G\",0)","v":0},null,null,0,0,{"$f":"IF(AND(T173=30,$R$4>=75,$R$4<=80),\"Dbl.\"&T173&\"G\",0)","v":0}]
[null,null,null,null,null,null,null,null,null,null,null,null,null,0,{"$f":"IF(AND($N$4<=32,$N$4>30),32,0)","v":0},{"$f":"IF(AND(O174=32,$M$4>=8,$M$4<=14),O174&\"A\",0)","v":0},null,null,0,{"$f":"IF(AND($S$4<=32,$S$4>30),32,0)","v":0},{"$f":"IF(AND(T174=32,$R$4>=8,$R$4<=14),T174&\"A\",0)","v":0}]
[null,null,null,null,null,null,null,null,null,null,null,null,null,0,0,{"$f":"IF(AND(O175=32,$M$4>=15,$M$4<=20),O175&\"B\",0)","v":0},null,null,0,0,{"$f":"IF(AND(T175=32,$R$4>=15,$R$4<=20),T175&\"B\",0)","v":0}]
[null,null,null,null,null,null,null,null,null,null,null,null,null,0,0,{"$f":"IF(AND(O176=32,$M$4>=21,$M$4<=25),O176&\"C\",0)","v":0},null,null,0,0,{"$f":"IF(AND(T176=32,$R$4>=21,$R$4<=25),T176&\"C\",0)","v":0}]
[null,null,null,null,null,null,null,null,null,null,null,null,null,0,0,{"$f":"IF(AND(O177=32,$M$4>=26,$M$4<=30),O177&\"D\",0)","v":0},null,null,0,0,{"$f":"IF(AND(T177=32,$R$4>=26,$R$4<=30),T177&\"D\",0)","v":0}]
[null,null,null,null,null,null,null,null,null,null,null,null,null,0,0,{"$f":"IF(AND(O178=32,$M$4>=31,$M$4<=34),O178&\"E\",0)","v":0},null,null,0,0,{"$f":"IF(AND(T178=32,$R$4>=31,$R$4<=34),T178&\"E\",0)","v":0}]
[null,null,null,null,null,null,null,null,null,null,null,null,null,0,0,{"$f":"IF(AND(O179=32,$M$4>=35,$M$4<=37),O179&\"F\",0)","v":0},null,null,0,0,{"$f":"IF(AND(T179=32,$R$4>=35,$R$4<=37),T179&\"F\",0)","v":0}]
[null,null,null,null,null,null,null,null,null,null,null,null,null,0,0,{"$f":"IF(AND(O180=32,$M$4>=38,$M$4<=40),O180&\"G\",0)","v":0},null,null,0,0,{"$f":"IF(AND(T180=32,$R$4>=38,$R$4<=40),T180&\"G\",0)","v":0}]
[null,null,null,null,null,null,null,null,null,null,null,null,null,0,0,{"$f":"IF(AND(O181=32,$M$4>=41,$M$4<=43),O181&\"H\",0)","v":0},null,null,0,0,{"$f":"IF(AND(T181=32,$R$4>=41,$R$4<=43),T181&\"H\",0)","v":0}]
[null,null,null,null,null,null,null,null,null,null,null,null,null,0,0,{"$f":"IF(AND(O182=32,$M$4>=44,$M$4<=45),O182&\"I\",0)","v":0},null,null,0,0,{"$f":"IF(AND(T182=32,$R$4>=44,$R$4<=45),T182&\"I\",0)","v":0}]
[null,null,null,null,null,null,null,null,null,null,null,null,null,0,0,{"$f":"IF(AND(O183=32,$M$4>=46,$M$4<=50),\"Dbl.\"&O183&\"C\",0)","v":0},null,null,0,0,{"$f":"IF(AND(T183=32,$R$4>=46,$R$4<=50),\"Dbl.\"&T183&\"C\",0)","v":0}]
[null,null,null,null,null,null,null,null,null,null,null,null,null,0,0,{"$f":"IF(AND(O184=32,$M$4>=51,$M$4<=60),\"Dbl.\"&O184&\"D\",0)","v":0},null,null,0,0,{"$f":"IF(AND(T184=32,$R$4>=51,$R$4<=60),\"Dbl.\"&T184&\"D\",0)","v":0}]
[null,null,null,null,null,null,null,null,null,null,null,null,null,0,0,{"$f":"IF(AND(O185=32,$M$4>=61,$M$4<=68),\"Dbl.\"&O185&\"E\",0)","v":0},null,null,0,0,{"$f":"IF(AND(T185=32,$R$4>=61,$R$4<=68),\"Dbl.\"&T185&\"E\",0)","v":0}]
[null,null,null,null,null,null,null,null,null,null,null,null,null,0,0,{"$f":"IF(AND(O186=32,$M$4>=69,$M$4<=74),\"Dbl.\"&O186&\"F\",0)","v":0},null,null,0,0,{"$f":"IF(AND(T186=32,$R$4>=69,$R$4<=74),\"Dbl.\"&T186&\"F\",0)","v":0}]
[null,null,null,null,null,null,null,null,null,null,null,null,null,0,0,{"$f":"IF(AND(O187=32,$M$4>=75,$M$4<=80),\"Dbl.\"&O187&\"G\",0)","v":0},null,null,0,0,{"$f":"IF(AND(T187=32,$R$4>=75,$R$4<=80),\"Dbl.\"&T187&\"G\",0)","v":0}]
[null,null,null,null,null,null,null,null,null,null,null,null,null,0,{"$f":"IF(AND($N$4<=34,$N$4>32),34,0)","v":0},{"$f":"IF(AND(O188=34,$M$4>=11,$M$4<=16),O188&\"A\",0)","v":0},null,null,0,{"$f":"IF(AND($S$4<=34,$S$4>32),34,0)","v":0},{"$f":"IF(AND(T188=34,$R$4>=11,$R$4<=16),T188&\"A\",0)","v":0}]
[null,null,null,null,null,null,null,null,null,null,null,null,null,0,0,{"$f":"IF(AND(O189=34,$M$4>=17,$M$4<=22),O189&\"B\",0)","v":0},null,null,0,0,{"$f":"IF(AND(T189=34,$R$4>=17,$R$4<=22),T189&\"B\",0)","v":0}]
[null,null,null,null,null,null,null,null,null,null,null,null,null,0,0,{"$f":"IF(AND(O190=34,$M$4>=23,$M$4<=27),O190&\"C\",0)","v":0},null,null,0,0,{"$f":"IF(AND(T190=34,$R$4>=23,$R$4<=27),T190&\"C\",0)","v":0}]
[null,null,null,null,null,null,null,null,null,null,null,null,null,0,0,{"$f":"IF(AND(O191=34,$M$4>=28,$M$4<=32),O191&\"D\",0)","v":0},null,null,0,0,{"$f":"IF(AND(T191=34,$R$4>=28,$R$4<=32),T191&\"D\",0)","v":0}]
[null,null,null,null,null,null,null,null,null,null,null,null,null,0,0,{"$f":"IF(AND(O192=34,$M$4>=33,$M$4<=34),O192&\"E\",0)","v":0},null,null,0,0,{"$f":"IF(AND(T192=34,$R$4>=33,$R$4<=34),T192&\"E\",0)","v":0}]
[null,null,null,null,null,null,null,null,null,null,null,null,null,0,0,{"$f":"IF(AND(O193=34,$M$4>=35,$M$4<=37),O193&\"F\",0)","v":0},null,null,0,0,{"$f":"IF(AND(T193=34,$R$4>=35,$R$4<=37),T193&\"F\",0)","v":0}]
[null,null,null,null,null,null,null,null,null,null,null,null,null,0,0,{"$f":"IF(AND(O194=34,$M$4>=38,$M$4<=40),O194&\"G\",0)","v":0},null,null,0,0,{"$f":"IF(AND(T194=34,$R$4>=38,$R$4<=40),T194&\"G\",0)","v":0}]
[null,null,null,null,null,null,null,null,null,null,null,null,null,0,0,{"$f":"IF(AND(O195=34,$M$4>=41,$M$4<=43),O195&\"H\",0)","v":0},null,null,0,0,{"$f":"IF(AND(T195=34,$R$4>=41,$R$4<=43),T195&\"H\",0)","v":0}]
[null,null,null,null,null,null,null,null,null,null,null,null,null,{"$f":"IF(AND(O196>0,P196>0),O196,0)","v":0},0,{"$f":"IF(AND(O196=34,$M$4>=44,$M$4<=45),O196&\"I\",0)","v":0},null,null,0,0,{"$f":"IF(AND(T196=34,$R$4>=44,$R$4<=45),T196&\"I\",0)","v":0}]
[null,null,null,null,null,null,null,null,null,null,null,null,null,0,0,{"$f":"IF(AND(O197=34,$M$4>=46,$M$4<=54),\"Dbl.\"&O197&\"C\",0)","v":0},null,null,{"$f":"IF(AND(T197>0,U197>0),T197,0)","v":0},0,{"$f":"IF(AND(T197=34,$R$4>=46,$R$4<=54),\"Dbl.\"&T197&\"C\",0)","v":0}]
[null,null,null,null,null,null,null,null,null,null,null,null,null,0,0,{"$f":"IF(AND(O198=34,$M$4>=55,$M$4<=64),\"Dbl.\"&O198&\"D\",0)","v":0},null,null,0,0,{"$f":"IF(AND(T198=34,$R$4>=55,$R$4<=64),\"Dbl.\"&T198&\"D\",0)","v":0}]
[null,null,null,null,null,null,null,null,null,null,null,null,null,0,0,{"$f":"IF(AND(O199=34,$M$4>=65,$M$4<=68),\"Dbl.\"&O199&\"E\",0)","v":0},null,null,0,0,{"$f":"IF(AND(T199=34,$R$4>=65,$R$4<=68),\"Dbl.\"&T199&\"E\",0)","v":0}]
[null,null,null,null,null,null,null,null,null,null,null,null,null,0,0,{"$f":"IF(AND(O200=34,$M$4>=69,$M$4<=74),\"Dbl.\"&O200&\"F\",0)","v":0},null,null,0,0,{"$f":"IF(AND(T200=34,$R$4>=69,$R$4<=74),\"Dbl.\"&T200&\"F\",0)","v":0}]
[null,null,null,null,null,null,null,null,null,null,null,null,null,0,0,{"$f":"IF(AND(O201=34,$M$4>=75,$M$4<=80),\"Dbl.\"&O201&\"G\",0)","v":0},null,null,0,0,{"$f":"IF(AND(T201=34,$R$4>=75,$R$4<=80),\"Dbl.\"&T201&\"G\",0)","v":0}]
[null,null,null,null,null,null,null,null,null,null,null,null,null,0,{"$f":"IF(AND($N$4<=36,$N$4>34),36,0)","v":0},{"$f":"IF(AND(O202=36,$M$4>=11,$M$4<=16),O202&\"A\",0)","v":0},null,null,0,{"$f":"IF(AND($S$4<=36,$S$4>34),36,0)","v":0},{"$f":"IF(AND(T202=36,$R$4>=11,$R$4<=16),T202&\"A\",0)","v":0}]
[null,null,null,null,null,null,null,null,null,null,null,null,null,0,0,{"$f":"IF(AND(O203=36,$M$4>=17,$M$4<=22),O203&\"B\",0)","v":0},null,null,0,0,{"$f":"IF(AND(T203=36,$R$4>=17,$R$4<=22),T203&\"B\",0)","v":0}]
[null,null,null,null,null,null,null,null,null,null,null,null,null,0,0,{"$f":"IF(AND(O204=36,$M$4>=23,$M$4<=27),O204&\"C\",0)","v":0},null,null,0,0,{"$f":"IF(AND(T204=36,$R$4>=23,$R$4<=27),T204&\"C\",0)","v":0}]
[null,null,null,null,null,null,null,null,null,null,null,null,null,0,0,{"$f":"IF(AND(O205=36,$M$4>=28,$M$4<=32),O205&\"D\",0)","v":0},null,null,0,0,{"$f":"IF(AND(T205=36,$R$4>=28,$R$4<=32),T205&\"D\",0)","v":0}]
[null,null,null,null,null,null,null,null,null,null,null,null,null,0,0,{"$f":"IF(AND(O206=36,$M$4>=33,$M$4<=34),O206&\"E\",0)","v":0},null,null,0,0,{"$f":"IF(AND(T206=36,$R$4>=33,$R$4<=34),T206&\"E\",0)","v":0}]
[null,null,null,null,null,null,null,null,null,null,null,null,null,0,0,{"$f":"IF(AND(O207=36,$M$4>=35,$M$4<=37),O207&\"F\",0)","v":0},null,null,0,0,{"$f":"IF(AND(T207=36,$R$4>=35,$R$4<=37),T207&\"F\",0)","v":0}]
[null,null,null,null,null,null,null,null,null,null,null,null,null,0,0,{"$f":"IF(AND(O208=36,$M$4>=38,$M$4<=40),O208&\"G\",0)","v":0},null,null,0,0,{"$f":"IF(AND(T208=36,$R$4>=38,$R$4<=40),T208&\"G\",0)","v":0}]
[null,null,null,null,null,null,null,null,null,null,null,null,null,0,0,{"$f":"IF(AND(O209=36,$M$4>=41,$M$4<=43),O209&\"H\",0)","v":0},null,null,0,0,{"$f":"IF(AND(T209=36,$R$4>=41,$R$4<=43),T209&\"H\",0)","v":0}]
[null,null,null,null,null,null,null,null,null,null,null,null,null,0,0,{"$f":"IF(AND(O210=36,$M$4>=44,$M$4<=45),O210&\"I\",0)","v":0},null,null,0,0,{"$f":"IF(AND(T210=36,$R$4>=44,$R$4<=45),T210&\"I\",0)","v":0}]
[null,null,null,null,null,null,null,null,null,null,null,null,null,0,0,{"$f":"IF(AND(O211=36,$M$4>=46,$M$4<=54),\"Dbl.\"&O211&\"C\",0)","v":0},null,null,0,0,{"$f":"IF(AND(T211=36,$R$4>=46,$R$4<=54),\"Dbl.\"&T211&\"C\",0)","v":0}]
[null,null,null,null,null,null,null,null,null,null,null,null,null,0,0,{"$f":"IF(AND(O212=36,$M$4>=55,$M$4<=64),\"Dbl.\"&O212&\"D\",0)","v":0},null,null,0,0,{"$f":"IF(AND(T212=36,$R$4>=55,$R$4<=64),\"Dbl.\"&T212&\"D\",0)","v":0}]
[null,null,null,null,null,null,null,null,null,null,null,null,null,0,0,{"$f":"IF(AND(O213=36,$M$4>=65,$M$4<=68),\"Dbl.\"&O213&\"E\",0)","v":0},null,null,0,0,{"$f":"IF(AND(T213=36,$R$4>=65,$R$4<=68),\"Dbl.\"&T213&\"E\",0)","v":0}]
[null,null,null,null,null,null,null,null,null,null,null,null,null,0,0,{"$f":"IF(AND(O214=36,$M$4>=69,$M$4<=74),\"Dbl.\"&O214&\"F\",0)","v":0},null,null,0,0,{"$f":"IF(AND(T214=36,$R$4>=69,$R$4<=74),\"Dbl.\"&T214&\"F\",0)","v":0}]
[null,null,null,null,null,null,null,null,null,null,null,null,null,0,0,{"$f":"IF(AND(O215=36,$M$4>=75,$M$4<=80),\"Dbl.\"&O215&\"G\",0)","v":0},null,null,0,0,{"$f":"IF(AND(T215=36,$R$4>=75,$R$4<=80),\"Dbl.\"&T215&\"G\",0)","v":0}]
[null,null,null,null,null,null,null,null,null,null,null,null,null,0,{"$f":"IF(AND($N$4<=38,$N$4>36),38,0)","v":0},{"$f":"IF(AND(O216=38,$M$4>=11,$M$4<=16),O216&\"A\",0)","v":0},null,null,0,{"$f":"IF(AND($S$4<=38,$S$4>36),38,0)","v":0},{"$f":"IF(AND(T216=38,$R$4>=11,$R$4<=16),T216&\"A\",0)","v":0}]
[null,null,null,null,null,null,null,null,null,null,null,null,null,0,0,{"$f":"IF(AND(O217=38,$M$4>=17,$M$4<=22),O217&\"B\",0)","v":0},null,null,{"$f":"IF(AND(T217>0,U217>0),T217,0)","v":0},0,{"$f":"IF(AND(T217=38,$R$4>=17,$R$4<=22),T217&\"B\",0)","v":0}]
[null,null,null,null,null,null,null,null,null,null,null,null,null,0,0,{"$f":"IF(AND(O218=38,$M$4>=23,$M$4<=27),O218&\"C\",0)","v":0},null,null,0,0,{"$f":"IF(AND(T218=38,$R$4>=23,$R$4<=27),T218&\"C\",0)","v":0}]
[null,null,null,null,null,null,null,null,null,null,null,null,null,0,0,{"$f":"IF(AND(O219=38,$M$4>=28,$M$4<=32),O219&\"D\",0)","v":0},null,null,0,0,{"$f":"IF(AND(T219=38,$R$4>=28,$R$4<=32),T219&\"D\",0)","v":0}]
[null,null,null,null,null,null,null,null,null,null,null,null,null,0,0,{"$f":"IF(AND(O220=38,$M$4>=33,$M$4<=34),O220&\"E\",0)","v":0},null,null,0,0,{"$f":"IF(AND(T220=38,$R$4>=33,$R$4<=34),T220&\"E\",0)","v":0}]
[null,null,null,null,null,null,null,null,null,null,null,null,null,0,0,{"$f":"IF(AND(O221=38,$M$4>=35,$M$4<=37),O221&\"F\",0)","v":0},null,null,0,0,{"$f":"IF(AND(T221=38,$R$4>=35,$R$4<=37),T221&\"F\",0)","v":0}]
[null,null,null,null,null,null,null,null,null,null,null,null,null,0,0,{"$f":"IF(AND(O222=38,$M$4>=38,$M$4<=40),O222&\"G\",0)","v":0},null,null,0,0,{"$f":"IF(AND(T222=38,$R$4>=38,$R$4<=40),T222&\"G\",0)","v":0}]
[null,null,null,null,null,null,null,null,null,null,null,null,null,0,0,{"$f":"IF(AND(O223=38,$M$4>=41,$M$4<=43),O223&\"H\",0)","v":0},null,null,0,0,{"$f":"IF(AND(T223=38,$R$4>=41,$R$4<=43),T223&\"H\",0)","v":0}]
[null,null,null,null,null,null,null,null,null,null,null,null,null,0,0,{"$f":"IF(AND(O224=38,$M$4>=44,$M$4<=45),O224&\"I\",0)","v":0},null,null,0,0,{"$f":"IF(AND(T224=38,$R$4>=44,$R$4<=45),T224&\"I\",0)","v":0}]
[null,null,null,null,null,null,null,null,null,null,null,null,null,0,0,{"$f":"IF(AND(O225=38,$M$4>=46,$M$4<=54),\"Dbl.\"&O225&\"C\",0)","v":0},null,null,0,0,{"$f":"IF(AND(T225=38,$R$4>=46,$R$4<=54),\"Dbl.\"&T225&\"C\",0)","v":0}]
[null,null,null,null,null,null,null,null,null,null,null,null,null,0,0,{"$f":"IF(AND(O226=38,$M$4>=55,$M$4<=64),\"Dbl.\"&O226&\"D\",0)","v":0},null,null,0,0,{"$f":"IF(AND(T226=38,$R$4>=55,$R$4<=64),\"Dbl.\"&T226&\"D\",0)","v":0}]
[null,null,null,null,null,null,null,null,null,null,null,null,null,0,0,{"$f":"IF(AND(O227=38,$M$4>=65,$M$4<=68),\"Dbl.\"&O227&\"E\",0)","v":0},null,null,0,0,{"$f":"IF(AND(T227=38,$R$4>=65,$R$4<=68),\"Dbl.\"&T227&\"E\",0)","v":0}]
[null,null,null,null,null,null,null,null,null,null,null,null,null,{"$f":"IF(AND(O228>0,P228>0),O228,0)","v":0},0,{"$f":"IF(AND(O228=38,$M$4>=69,$M$4<=74),\"Dbl.\"&O228&\"F\",0)","v":0},null,null,0,0,{"$f":"IF(AND(T228=38,$R$4>=69,$R$4<=74),\"Dbl.\"&T228&\"F\",0)","v":0}]
[null,null,null,null,null,null,null,null,null,null,null,null,null,{"$f":"IF(AND(O229>0,P229>0),O229,0)","v":0},0,{"$f":"IF(AND(O229=38,$M$4>=75,$M$4<=80),\"Dbl.\"&O229&\"G\",0)","v":0},null,null,0,0,{"$f":"IF(AND(T229=38,$R$4>=75,$R$4<=80),\"Dbl.\"&T229&\"G\",0)","v":0}]
[null,null,null,null,null,null,null,null,null,null,null,null,null,{"$f":"IF(AND(O230>0,P230>0),O230,0)","v":0},{"$f":"IF(AND($N$4<=40,$N$4>38),40,0)","v":0},{"$f":"IF(AND(O230=40,$M$4>=11,$M$4<=16),O230&\"A\",0)","v":0},null,null,0,{"$f":"IF(AND($S$4<=40,$S$4>38),40,0)","v":0},{"$f":"IF(AND(T230=40,$R$4>=11,$R$4<=16),T230&\"A\",0)","v":0}]
[null,null,null,null,null,null,null,null,null,null,null,null,null,0,0,{"$f":"IF(AND(O231=40,$M$4>=17,$M$4<=22),O231&\"B\",0)","v":0},null,null,0,0,{"$f":"IF(AND(T231=40,$R$4>=17,$R$4<=22),T231&\"B\",0)","v":0}]
[null,null,null,null,null,null,null,null,null,null,null,null,null,0,0,{"$f":"IF(AND(O232=40,$M$4>=23,$M$4<=27),O232&\"C\",0)","v":0},null,null,0,0,{"$f":"IF(AND(T232=40,$R$4>=23,$R$4<=27),T232&\"C\",0)","v":0}]
[null,null,null,null,null,null,null,null,null,null,null,null,null,0,0,{"$f":"IF(AND(O233=40,$M$4>=28,$M$4<=32),O233&\"D\",0)","v":0},null,null,0,0,{"$f":"IF(AND(T233=40,$R$4>=28,$R$4<=32),T233&\"D\",0)","v":0}]
[null,null,null,null,null,null,null,null,null,null,null,null,null,0,0,{"$f":"IF(AND(O234=40,$M$4>=33,$M$4<=34),O234&\"E\",0)","v":0},null,null,0,0,{"$f":"IF(AND(T234=40,$R$4>=33,$R$4<=34),T234&\"E\",0)","v":0}]
[null,null,null,null,null,null,null,null,null,null,null,null,null,0,0,{"$f":"IF(AND(O235=40,$M$4>=35,$M$4<=37),O235&\"F\",0)","v":0},null,null,0,0,{"$f":"IF(AND(T235=40,$R$4>=35,$R$4<=37),T235&\"F\",0)","v":0}]
[null,null,null,null,null,null,null,null,null,null,null,null,null,0,0,{"$f":"IF(AND(O236=40,$M$4>=38,$M$4<=40),O236&\"G\",0)","v":0},null,null,0,0,{"$f":"IF(AND(T236=40,$R$4>=38,$R$4<=40),T236&\"G\",0)","v":0}]
[null,null,null,null,null,null,null,null,null,null,null,null,null,0,0,{"$f":"IF(AND(O237=40,$M$4>=41,$M$4<=43),O237&\"H\",0)","v":0},null,null,0,0,{"$f":"IF(AND(T237=40,$R$4>=41,$R$4<=43),T237&\"H\",0)","v":0}]
[null,null,null,null,null,null,null,null,null,null,null,null,null,0,0,{"$f":"IF(AND(O238=40,$M$4>=44,$M$4<=45),O238&\"I\",0)","v":0},null,null,0,0,{"$f":"IF(AND(T238=40,$R$4>=44,$R$4<=45),T238&\"I\",0)","v":0}]
[null,null,null,null,null,null,null,null,null,null,null,null,null,0,0,{"$f":"IF(AND(O239=40,$M$4>=46,$M$4<=54),\"Dbl.\"&O239&\"C\",0)","v":0},null,null,0,0,{"$f":"IF(AND(T239=40,$R$4>=46,$R$4<=54),\"Dbl.\"&T239&\"C\",0)","v":0}]
[null,null,null,null,null,null,null,null,null,null,null,null,null,0,0,{"$f":"IF(AND(O240=40,$M$4>=55,$M$4<=64),\"Dbl.\"&O240&\"D\",0)","v":0},null,null,0,0,{"$f":"IF(AND(T240=40,$R$4>=55,$R$4<=64),\"Dbl.\"&T240&\"D\",0)","v":0}]
[null,null,null,null,null,null,null,null,null,null,null,null,null,0,0,{"$f":"IF(AND(O241=40,$M$4>=65,$M$4<=68),\"Dbl.\"&O241&\"E\",0)","v":0},null,null,0,0,{"$f":"IF(AND(T241=40,$R$4>=65,$R$4<=68),\"Dbl.\"&T241&\"E\",0)","v":0}]
[null,null,null,null,null,null,null,null,null,null,null,null,null,0,{"$f":"IF(AND($N$4<=40,$N$4>38),470,0)","v":0},{"$f":"IF(AND(O242=40,$M$4>=69,$M$4<=74),\"Dbl.\"&O242&\"F\",0)","v":0},null,null,0,0,{"$f":"IF(AND(T242=40,$R$4>=69,$R$4<=74),\"Dbl.\"&T242&\"F\",0)","v":0}]
[null,null,null,null,null,null,null,null,null,null,null,null,null,0,{"$f":"IF(AND($N$4<=40,$N$4>38),40,0)","v":0},{"$f":"IF(AND(O243=40,$M$4>=75,$M$4<=80),\"Dbl.\"&O243&\"G\",0)","v":0},null,null,0,0,{"$f":"IF(AND(T243=40,$R$4>=75,$R$4<=80),\"Dbl.\"&T243&\"G\",0)","v":0}]
[null,null,null,null,null,null,null,null,null,null,null,null,null,0,{"$f":"IF(AND($N$4<=42,$N$4>40),42,0)","v":0},{"$f":"IF(AND(O244=42,$M$4>=11,$M$4<=16),O244&\"A\",0)","v":0},null,null,0,{"$f":"IF(AND($S$4<=42,$S$4>40),42,0)","v":0},{"$f":"IF(AND(T244=42,$R$4>=11,$R$4<=16),T244&\"A\",0)","v":0}]
[null,null,null,null,null,null,null,null,null,null,null,null,null,0,0,{"$f":"IF(AND(O245=42,$M$4>=17,$M$4<=22),O245&\"B\",0)","v":0},null,null,0,0,{"$f":"IF(AND(T245=42,$R$4>=17,$R$4<=22),T245&\"B\",0)","v":0}]
[null,null,null,null,null,null,null,null,null,null,null,null,null,0,0,{"$f":"IF(AND(O246=42,$M$4>=23,$M$4<=27),O246&\"C\",0)","v":0},null,null,0,0,{"$f":"IF(AND(T246=42,$R$4>=23,$R$4<=27),T246&\"C\",0)","v":0}]
[null,null,null,null,null,null,null,null,null,null,null,null,null,0,0,{"$f":"IF(AND(O247=42,$M$4>=28,$M$4<=32),O247&\"D\",0)","v":0},null,null,0,0,{"$f":"IF(AND(T247=42,$R$4>=28,$R$4<=32),T247&\"D\",0)","v":0}]
[null,null,null,null,null,null,null,null,null,null,null,null,null,0,0,{"$f":"IF(AND(O248=42,$M$4>=33,$M$4<=34),O248&\"E\",0)","v":0},null,null,0,0,{"$f":"IF(AND(T248=42,$R$4>=33,$R$4<=34),T248&\"E\",0)","v":0}]
[null,null,null,null,null,null,null,null,null,null,null,null,null,0,0,{"$f":"IF(AND(O249=42,$M$4>=35,$M$4<=37),O249&\"F\",0)","v":0},null,null,0,0,{"$f":"IF(AND(T249=42,$R$4>=35,$R$4<=37),T249&\"F\",0)","v":0}]
[null,null,null,null,null,null,null,null,null,null,null,null,null,0,0,{"$f":"IF(AND(O250=42,$M$4>=38,$M$4<=40),O250&\"G\",0)","v":0},null,null,0,0,{"$f":"IF(AND(T250=42,$R$4>=38,$R$4<=40),T250&\"G\",0)","v":0}]
[null,null,null,null,null,null,null,null,null,null,null,null,null,0,0,{"$f":"IF(AND(O251=42,$M$4>=41,$M$4<=43),O251&\"H\",0)","v":0},null,null,0,0,{"$f":"IF(AND(T251=42,$R$4>=41,$R$4<=43),T251&\"H\",0)","v":0}]
[null,null,null,null,null,null,null,null,null,null,null,null,null,0,0,{"$f":"IF(AND(O252=42,$M$4>=44,$M$4<=45),O252&\"I\",0)","v":0},null,null,0,0,{"$f":"IF(AND(T252=42,$R$4>=44,$R$4<=45),T252&\"I\",0)","v":0}]
[null,null,null,null,null,null,null,null,null,null,null,null,null,0,0,{"$f":"IF(AND(O253=42,$M$4>=46,$M$4<=54),\"Dbl.\"&O253&\"C\",0)","v":0},null,null,0,0,{"$f":"IF(AND(T253=42,$R$4>=46,$R$4<=54),\"Dbl.\"&T253&\"C\",0)","v":0}]
[null,null,null,null,null,null,null,null,null,null,null,null,null,0,0,{"$f":"IF(AND(O254=42,$M$4>=55,$M$4<=64),\"Dbl.\"&O254&\"D\",0)","v":0},null,null,0,0,{"$f":"IF(AND(T254=42,$R$4>=55,$R$4<=64),\"Dbl.\"&T254&\"D\",0)","v":0}]
[null,null,null,null,null,null,null,null,null,null,null,null,null,0,0,{"$f":"IF(AND(O255=42,$M$4>=65,$M$4<=68),\"Dbl.\"&O255&\"E\",0)","v":0},null,null,0,0,{"$f":"IF(AND(T255=42,$R$4>=65,$R$4<=68),\"Dbl.\"&T255&\"E\",0)","v":0}]
[null,null,null,null,null,null,null,null,null,null,null,null,null,0,0,{"$f":"IF(AND(O256=42,$M$4>=69,$M$4<=74),\"Dbl.\"&O256&\"F\",0)","v":0},null,null,0,0,{"$f":"IF(AND(T256=42,$R$4>=69,$R$4<=74),\"Dbl.\"&T256&\"F\",0)","v":0}]
[null,null,null,null,null,null,null,null,null,null,null,null,null,0,0,{"$f":"IF(AND(O257=42,$M$4>=75,$M$4<=80),\"Dbl.\"&O257&\"G\",0)","v":0},null,null,0,0,{"$f":"IF(AND(T257=42,$R$4>=75,$R$4<=80),\"Dbl.\"&T257&\"G\",0)","v":0}]
[null,null,null,null,null,null,null,null,null,null,null,null,null,0,{"$f":"IF(AND($N$4<=44,$N$4>42),44,0)","v":0},{"$f":"IF(AND(O258=44,$M$4>=11,$M$4<=16),O258&\"A\",0)","v":0},null,null,0,{"$f":"IF(AND($S$4<=44,$S$4>42),44,0)","v":0},{"$f":"IF(AND(T258=44,$R$4>=11,$R$4<=16),T258&\"A\",0)","v":0}]
[null,null,null,null,null,null,null,null,null,null,null,null,null,0,0,{"$f":"IF(AND(O259=44,$M$4>=17,$M$4<=22),O259&\"B\",0)","v":0},null,null,{"$f":"IF(AND(T259>0,U259>0),T259,0)","v":0},0,{"$f":"IF(AND(T259=44,$R$4>=17,$R$4<=22),T259&\"B\",0)","v":0}]
[null,null,null,null,null,null,null,null,null,null,null,null,null,0,0,{"$f":"IF(AND(O260=44,$M$4>=23,$M$4<=27),O260&\"C\",0)","v":0},null,null,0,0,{"$f":"IF(AND(T260=44,$R$4>=23,$R$4<=27),T260&\"C\",0)","v":0}]
[null,null,null,null,null,null,null,null,null,null,null,null,null,0,0,{"$f":"IF(AND(O261=44,$M$4>=28,$M$4<=32),O261&\"D\",0)","v":0},null,null,0,0,{"$f":"IF(AND(T261=44,$R$4>=28,$R$4<=32),T261&\"D\",0)","v":0}]
[null,null,null,null,null,null,null,null,null,null,null,null,null,0,0,{"$f":"IF(AND(O262=44,$M$4>=33,$M$4<=34),O262&\"E\",0)","v":0},null,null,0,0,{"$f":"IF(AND(T262=44,$R$4>=33,$R$4<=34),T262&\"E\",0)","v":0}]
[null,null,null,null,null,null,null,null,null,null,null,null,null,0,0,{"$f":"IF(AND(O263=44,$M$4>=35,$M$4<=37),O263&\"F\",0)","v":0},null,null,0,0,{"$f":"IF(AND(T263=44,$R$4>=35,$R$4<=37),T263&\"F\",0)","v":0}]
[null,null,null,null,null,null,null,null,null,null,null,null,null,0,0,{"$f":"IF(AND(O264=44,$M$4>=38,$M$4<=40),O264&\"G\",0)","v":0},null,null,0,0,{"$f":"IF(AND(T264=44,$R$4>=38,$R$4<=40),T264&\"G\",0)","v":0}]
[null,null,null,null,null,null,null,null,null,null,null,null,null,0,0,{"$f":"IF(AND(O265=44,$M$4>=41,$M$4<=43),O265&\"H\",0)","v":0},null,null,0,0,{"$f":"IF(AND(T265=44,$R$4>=41,$R$4<=43),T265&\"H\",0)","v":0}]
[null,null,null,null,null,null,null,null,null,null,null,null,null,0,0,{"$f":"IF(AND(O266=44,$M$4>=44,$M$4<=45),O266&\"I\",0)","v":0},null,null,0,0,{"$f":"IF(AND(T266=44,$R$4>=44,$R$4<=45),T266&\"I\",0)","v":0}]
[null,null,null,null,null,null,null,null,null,null,null,null,null,0,0,{"$f":"IF(AND(O267=44,$M$4>=46,$M$4<=54),\"Dbl.\"&O267&\"C\",0)","v":0},null,null,0,0,{"$f":"IF(AND(T267=44,$R$4>=46,$R$4<=54),\"Dbl.\"&T267&\"C\",0)","v":0}]
[null,null,null,null,null,null,null,null,null,null,null,null,null,0,0,{"$f":"IF(AND(O268=44,$M$4>=55,$M$4<=64),\"Dbl.\"&O268&\"D\",0)","v":0},null,null,0,0,{"$f":"IF(AND(T268=44,$R$4>=55,$R$4<=64),\"Dbl.\"&T268&\"D\",0)","v":0}]
[null,null,null,null,null,null,null,null,null,null,null,null,null,0,0,{"$f":"IF(AND(O269=44,$M$4>=65,$M$4<=68),\"Dbl.\"&O269&\"E\",0)","v":0},null,null,0,0,{"$f":"IF(AND(T269=44,$R$4>=65,$R$4<=68),\"Dbl.\"&T269&\"E\",0)","v":0}]
[null,null,null,null,null,null,null,null,null,null,null,null,null,{"$f":"IF(AND(O270>0,P270>0),O270,0)","v":0},0,{"$f":"IF(AND(O270=44,$M$4>=69,$M$4<=74),\"Dbl.\"&O270&\"F\",0)","v":0},null,null,0,0,{"$f":"IF(AND(T270=44,$R$4>=69,$R$4<=74),\"Dbl.\"&T270&\"F\",0)","v":0}]
[null,null,null,null,null,null,null,null,null,null,null,null,null,{"$f":"IF(AND(O271>0,P271>0),O271,0)","v":0},0,{"$f":"IF(AND(O271=44,$M$4>=75,$M$4<=80),\"Dbl.\"&O271&\"G\",0)","v":0},null,null,0,0,{"$f":"IF(AND(T271=44,$R$4>=75,$R$4<=80),\"Dbl.\"&T271&\"G\",0)","v":0}]

{"sheet":"Tables","index":2,"n_rows":142,"n_cols":40,"rows_kept":142,"cut":false,"hidden":true,"merged":[[1,32,1,34],[14,15,14,20]]}
[null,"S140 / S144 / S146 Calculations"]
[null,"Frame Cut Leg",{"$f":"LEG+6","v":6},null,null,1,"SashW","SashH","GlassW","GlassH","Radius","Weight",null,null,{"$f":"IF(OR(ModelNo=\"1700\",ModelNo=\"1720\",ModelNo=\"1730\",ModelNo=\"1900\",ModelNo=\"1920\",ModelNo=\"1930\",ModelNo=\"1901\",ModelNo=\"1921\",ModelNo=\"1931\"),1,0)","v":0},"1700","1720","1730","1900","1920","1930","1901","1921","1931",null,null,null,null,null,"Glass Strength",null,null,"CFB"]
[null,"CMRD",{"$f":"Frame_Height-C2","v":-6},null,"Mezzo",2,{"$f":"Frame_Width-3.125","v":-3.125},{"$f":"CDIM_S140-1.125","v":-1.125},{"$f":"G3-1.6875","v":-4.8125},{"$f":"H3-1.625","v":-2.75},12.5,{"$f":"BWGT_03A0","v":{"$error":"#VALUE!"}},null,null,"TGW",{"$f":"IF(TGW_1700>40.5,1,0)","v":0},{"$f":"IF(TGW_1720>40.25,1,0)","v":0},{"$f":"IF(TGW_1730>25.5,1,0)","v":0},{"$f":"IF(TGW_1900>40.5,1,0)","v":0},{"$f":"IF(TGW_1920>40.25,1,0)","v":0},{"$f":"IF(TGW_1930>25.5,1,0)","v":0},{"$f":"IF(TGW_1901>39.25,1,0)","v":0},{"$f":"IF(TGW_1921>39,1,0)","v":0},{"$f":"IF(TGW_1931>30.9375,1,0)","v":0},null,null,1,{"$f":"IF(AD3>\"\",VLOOKUP(AD3,GLASSLOOKUP,2,FALSE),\"\")","v":""},{"$f":"IF(AD3>\"\",VLOOKUP(AB3,WEIGHTCHART,2,FALSE),\"\")","v":""},{"$f":"GLASS1","v":""},null,{"$f":"VLOOKUP(BTM_WGT,CFB_W,3,FALSE)","v":{"$error":"#N/A"}},4,3,"BN",null,null,"Extrusion"]
[null,"Sash Cut back",{"$f":"IF(OR(EXTSELECT=2,EXTSELECT=3),3.125,IF(OR(EXTSELECT=4,EXTSELECT=5),2.3125,IF(EXTSELECT=6,2.25,0)))","v":0},null,"Mezzo",3,{"$f":"Frame_Width-3.125","v":-3.125},{"$f":"CDIM_S140-1.125","v":-1.125},{"$f":"G4-1.6875","v":-4.8125},{"$f":"H4-1.625","v":-2.75},13,{"$f":"BWGT_03A0","v":{"$error":"#VALUE!"}},null,null,"TGH",{"$f":"IF(TGH_1700>35.34375,1,0)","v":0},{"$f":"IF(TGH_1720>35.34375,1,0)","v":0},{"$f":"IF(TGH_1730>35.34375,1,0)","v":0},{"$f":"IF(TGH_1900>35.34375,1,0)","v":0},{"$f":"IF(TGH_1920>35.34375,1,0)","v":0},{"$f":"IF(TGH_1930>35.34375,1,0)","v":0},{"$f":"IF(TGH_1901>35.1875,1,0)","v":0},{"$f":"IF(TGH_1921>35.1875,1,0)","v":0},{"$f":"IF(TGH_1931>35.1875,1,0)","v":0},null,null,2,"","",{"$f":"GLASS2","v":""},null,null,{"$f":"AG3+1","v":5},3,"BN",null,1,{"$f":"IF(EXT_1=0,\"\",EXT_1)","v":""},0,0]
[null,"F",{"$f":"2*(ASIN((EXT*2)/(2*C11)))","v":{"$error":"#DIV/0!"}},null,"0700",4,{"$f":"Frame_Width-2.3125","v":-2.3125},{"$f":"CDIM_S140+0.125","v":0.125},{"$f":"Frame_Width-4","v":-4},{"$f":"CDIM_S140-1.5625","v":-1.5625},10,{"$f":"BWGT_0100","v":{"$error":"#VALUE!"}},null,null,"BGW",{"$f":"IF(BGW_1700>40.5,1,0)","v":0},{"$f":"IF(BGW_1720>40.25,1,0)","v":0},{"$f":"IF(BGW_1730>25.46875,1,0)","v":0},{"$f":"IF(BGW_1900>40.5,1,0)","v":0},{"$f":"IF(BGW_1920>40.25,1,0)","v":0},{"$f":"IF(BGW_1930>25.5,1,0)","v":0},{"$f":"IF(BGW_1901>40.5,1,0)","v":0},{"$f":"IF(BGW_1921>40.25,1,0)","v":0},{"$f":"IF(BGW_1931>32.1875,1,0)","v":0},null,null,3,"","",{"$f":"GLASS3","v":""},null,null,6,3,"BN",null,2,{"$f":"IF(EXT_2=0,\"\",EXT_2)","v":""},2.40625,12.5]
[null,"d",{"$f":"C11*COS(C5/2)","v":{"$error":"#DIV/0!"}},null,"Fusion",5,{"$f":"Frame_Width-2.25","v":-2.25},{"$f":"CDIM_S140-0.75","v":-0.75},{"$f":"Frame_Width-3.9375","v":-3.9375},{"$f":"CDIM_S140-2.4375","v":-2.4375},11.75,{"$f":"BWGT_02A0","v":{"$error":"#VALUE!"}},null,null,"BGH",{"$f":"IF(BGH_1700>35.34375,1,0)","v":0},{"$f":"IF(BGH_1720>35.34375,1,0)","v":0},{"$f":"IF(BGH_1730>35.34375,1,0)","v":0},{"$f":"IF(BGH_1900>35.3125,1,0)","v":0},{"$f":"IF(BGH_1920>35.34375,1,0)","v":0},{"$f":"IF(BGH_1930>35.3125,1,0)","v":0},{"$f":"IF(BGH_1901>35.1875,1,0)","v":0},{"$f":"IF(BGH_1921>35.1875,1,0)","v":0},{"$f":"IF(BGH_1931>35.1875,1,0)","v":0},null,null,4,"","",{"$f":"GLASS4","v":""},null,null,7,4,"RD",null,3,{"$f":"IF(EXT_3=0,\"\",EXT_3)","v":""},2.40625,13]
[null,"h",{"$f":"C11-C6","v":{"$error":"#DIV/0!"}},null,1700,6,{"$f":"Frame_Width-2.1875","v":-2.1875},{"$f":"CDIM_S140-0.84375","v":-0.84375},{"$f":"G7-1.3125","v":-3.5},{"$f":"H7-1.3125","v":-2.15625},12,{"$f":"Balance!E40","v":{"$error":"#VALUE!"}},null,null,null,{"$f":"MAX(P3:P6)","v":0},0,0,0,0,0,0,0,0,null,null,5,"","",{"$f":"GLASS5","v":""},null,null,8,4,"RD",null,4,{"$f":"IF(EXT_5=0,\"\",EXT_5)","v":""},1,10]
[null,null,{"$f":"IF(ModelNo=\"S146\",((Frame_Height-LEG)/2)+(((Frame_Width*2)^2)/(8*(Frame_Height-LEG))),((Frame_Height-LEG)/2)+((Frame_Width^2)/(8*(Frame_Height-LEG))))","v":{"$error":"#DIV/0!"}},null,1900,7,{"$f":"Frame_Width-2.1875","v":-2.1875},{"$f":"CDIM_S140-1.03125","v":-1.03125},{"$f":"G8-1.3125","v":-3.5},{"$f":"H8-1.3125","v":-2.34375},12,{"$f":"Balance!E52","v":{"$error":"#VALUE!"}},null,"Stile Reinf. Driver >>",{"$f":"MAX(P8:X8,O9,O10)","v":0},{"$f":"IF(ModelNo=\"1700\",HLOOKUP(Model_Select,REINF_CHART,6,FALSE),0)","v":0},{"$f":"IF(ModelNo=\"1720\",HLOOKUP(Model_Select,REINF_CHART,6,FALSE),0)","v":0},{"$f":"IF(ModelNo=\"1730\",HLOOKUP(Model_Select,REINF_CHART,6,FALSE),0)","v":0},{"$f":"IF(ModelNo=\"1900\",HLOOKUP(Model_Select,REINF_CHART,6,FALSE),0)","v":0},{"$f":"IF(ModelNo=\"1920\",HLOOKUP(Model_Select,REINF_CHART,6,FALSE),0)","v":0},{"$f":"IF(ModelNo=\"1930\",HLOOKUP(Model_Select,REINF_CHART,6,FALSE),0)","v":0},{"$f":"IF(ModelNo=\"1901\",HLOOKUP(Model_Select,REINF_CHART,6,FALSE),0)","v":0},{"$f":"IF(ModelNo=\"1921\",HLOOKUP(Model_Select,REINF_CHART,6,FALSE),0)","v":0},{"$f":"IF(ModelNo=\"1931\",HLOOKUP(Model_Select,REINF_CHART,6,FALSE),0)","v":0},null,null,6,"","",{"$f":"GLASS6","v":""},null,null,9,5,"BU",null,5,{"$f":"IF(EXT_4=0,\"\",EXT_6)","v":""},1.75,11.75]
[null,"Top Glass Width",{"$f":"TRUNC((Frame_Width-2*EXT)*16+0.5)/16","v":0},null,null,{"$f":"EXTTYPE","v":""},{"$f":"IF(EXTSELECT>1,VLOOKUP(EXTSELECT,$F$3:$L$8,2,FALSE),0)","v":0},{"$f":"IF(EXTSELECT>1,VLOOKUP(EXTSELECT,$F$3:$L$8,3,FALSE),0)","v":0},{"$f":"IF(EXTSELECT>1,VLOOKUP(EXTSELECT,$F$3:$L$8,4,FALSE),0)","v":0},{"$f":"IF(EXTSELECT>1,VLOOKUP(EXTSELECT,$F$3:$L$8,5,FALSE),0)","v":0},{"$f":"IF(EXTSELECT>1,VLOOKUP(EXTSELECT,$F$3:$L$8,6,FALSE),0)","v":0},{"$f":"IF(EXTSELECT>1,VLOOKUP(EXTSELECT,$F$3:$L$8,7,FALSE),0)","v":0},null,"Oriel >>",{"$f":"IF(TYPE>1,1,0)","v":0},null,null,null,null,null,null,null,null,null,null,null,7,"","",{"$f":"GLASS7","v":""},null,null,10,5,"BU",null,6,{"$f":"IF(EXT_4=0,\"\",EXT_7)","v":""},1.8125,12]
[null,"Top Glass Height",{"$f":"IF(ModelNo=\"S146\",Frame_Height-(Tables!$C$16+$C$13+EXT+C7),Frame_Height-(Tables!$C$16+C13+EXT))","v":-0.51370000000000005},null,null,null,null,null,null,null,null,null,null,"HP >>",{"$f":"IF(EXTTYPE=\"HP Package\",1,0)","v":0},null,null,null,null,null,null,null,null,null,null,null,8,"","",{"$f":"GLASS8","v":""},null,null,11,6,"YW",null,7,{"$f":"IF(EXT_5=0,\"\",EXT_8)","v":""},1.8125,12]
[null,"Glass R:",{"$f":"FrameR-EXT","v":{"$error":"#DIV/0!"}},null,null,null,null,null,null,null,null,null,null,null,null,null,null,null,null,null,null,null,null,null,null,null,null,null,null,1,null,null,12,6,"YW",null,null,1,{"$f":"VLOOKUP(EXTSELECT,AK4:AM10,3,FALSE)","v":0},{"$f":"VLOOKUP(EXTSELECT,AK4:AL10,2,FALSE)","v":""}]
[null," Glass h:",{"$f":"IF(ModelNo=\"S146\",C11-(SQRT((4*C11^2)-(C9*2+(2*EXT))^2))/2,C11-(SQRT((4*C11^2)-(C9)^2)/2))","v":{"$error":"#DIV/0!"}},null,null,null,null,null,null,null,null,null,null,null,null,null,null,null,null,null,null,null,null,null,null,null,null,null,{"$f":"VLOOKUP(GT,AB3:AC10,2,FALSE)","v":""},{"$f":"VLOOKUP(Glass,AA3:AC10,2,FALSE)","v":""},null,null,13,7,"GN"]
[null,null,{"$f":"IF(OR(EXTSELECT=4,EXTSELECT=5),0.9198,IF(OR(EXTSELECT=2,EXTSELECT=3),0.264,IF(OR(EXTSELECT=7,EXTSELECT=8),0.407,0.5137)))","v":0.51370000000000005},null,null,null,null,null,null,null,null,null,null,null,null,null,null,null,null,null,null,null,null,null,null,null,null,null,null,null,null,null,14,7,"GN",null,null,null,"S140",{"$f":"IF(OR(EXTSELECT=6,EXTSELECT=7),1,0)","v":0}]
[null,"Top Glass Leg:",{"$f":"IF(ModelNo=\"S146\",C10-C12+C7,C10-C12)","v":{"$error":"#DIV/0!"}},null,null,null,null,null,null,null,null,null,null,null,null,null,null,null,null,null,null,null,null,null,null,null,null,null,null,null,null,null,15,8,"LG",null,null,null,"S144",{"$f":"IF(OR(EXTSELECT=6,EXTSELECT=7),1,0)","v":0}]
[null,"DDIM_S140",{"$f":"IF(TYPE=1,(Frame_Height/2)-CMRD,IF(TYPE=2,CMR-CMRD))","v":6},null,null,null,null,null,null,null,null,null,null,null,false,"AC SASH CALCULATOR",null,null,null,null,null,null,null,null,null,null,null,null,null,null,null,null,16,8,"LG",null,null,null,"S146",{"$f":"IF(OR(EXTSELECT=6,EXTSELECT=7),1,0)","v":0}]
[null,"CDIM_S140",{"$f":"Tables!C2-DDIM_S140","v":0},null,null,null,null,null,null,null,null,null,null,null,"Model","Head+4.5","Sill","Center of Astragal","Sash Width","Sash Height","CMR",null,null,null,null,null,null,null,null,null,null,null,17,9,"NAT",null,null,null,null,{"$f":"IF(ISERROR(VLOOKUP(ModelNo,AM13:AN15,2,FALSE)),0,VLOOKUP(ModelNo,AM13:AN15,2,FALSE))","v":0}]
[null,null,null,null,null,null,null,null,null,null,null,null,null,null,{"$f":"ModelNo","v":"Select Model"},{"$f":"IF(ISERROR(VLOOKUP(ModelNo,ACTABLE,2,FALSE)),\"\",VLOOKUP(ModelNo,ACTABLE,2,FALSE))","v":""},{"$f":"IF(ISERROR(VLOOKUP(ModelNo,ACTABLE,3,FALSE)),\"\",VLOOKUP(ModelNo,ACTABLE,3,FALSE))","v":""},{"$f":"IF(ISERROR(VLOOKUP(ModelNo,ACTABLE,4,FALSE)),\"\",VLOOKUP(ModelNo,ACTABLE,4,FALSE))","v":""},{"$f":"IF(ISERROR(VLOOKUP(ModelNo,ACTABLE,5,FALSE)),\"\",VLOOKUP(ModelNo,ACTABLE,5,FALSE))","v":""},{"$f":"IF(ISERROR(VLOOKUP(ModelNo,ACTABLE,6,FALSE)),\"\",VLOOKUP(ModelNo,ACTABLE,6,FALSE))","v":""},{"$f":"IF(ISERROR(VLOOKUP(ModelNo,ACTABLE,7,FALSE)),\"\",VLOOKUP(ModelNo,ACTABLE,7,FALSE))","v":""},null,null,null,null,null,null,null,null,null,null,null,18,9,"NAT"]
[null,"SASHSTOP3001",null,null,null,"Type",null,null,null,null,null,null,null,null,"L201",1.625,1.75,null,{"$f":"Frame_Width-3.25","v":-3.25},{"$f":"INT((Frame_Height-(P18+Q18+0.5+ACHEIGHT))*16+0.5)/16","v":-3.875},null,null,null,null,null,null,null,null,null,null,null,null,19,10,"PK"]
[null,{"$f":"IF(TSH_3001<CDIM_3001-1.875,CDIM_3001-TSH_3001+11-0.875,0)","v":0},null,null,1,{"$f":"IF(TYPE1>\"\",TYPE1,\"\")","v":""},null,null,null,null,null,null,null,null,"8001",2.5,2.5,null,{"$f":"Frame_Width-4.9375","v":-4.9375},{"$f":"INT((Frame_Height-(P19+Q19+0.5+ACHEIGHT))*16+0.5)/16","v":-5.5},null,null,null,null,null,null,null,null,null,null,null,null,20,10,"PK"]
[null,{"$f":"IF(TSH_3001<(CDIM_3001-1.875),0,IF(CDIM_3001<=39,7,0))","v":7},null,null,2,{"$f":"IF(TYPE2>\"\",TYPE2,\"\")","v":""},null,null,null,null,null,null,null,null,"R601",2.5,2.5,null,{"$f":"Frame_Width-4.9375","v":-4.9375},{"$f":"INT((Frame_Height-(P20+Q20+0.5+ACHEIGHT))*16+0.5)/16","v":-5.5},null,null,null,null,null,null,null,null,null,null,null,null,21,"11","BU"]
[null,{"$f":"IF(TSH_3001<(CDIM_3001-1.875),0,IF(AND(CDIM_3001>39,CDIM_3001<=42),10,0))","v":0},null,null,3,{"$f":"IF(TYPE3>\"\",TYPE3,\"\")","v":""},null,null,null,null,null,null,null,null,"S140",null,{"$f":"IF(OR(EXTSELECT=2,EXTSELECT=3),1.875,IF(OR(EXTSELECT=4,EXTSELECT=5),1.537,IF(EXTSELECT=7,1.818,IF(EXTSELECT=8,2,1.75))))","v":1.75},{"$f":"IF(OR(EXTSELECT=2,EXTSELECT=3),1.25,IF(EXTSELECT=4,1.0625,IF(EXTSELECT=5,1.1875,IF(EXTSELECT=7,0.4375,IF(EXTSELECT=8,1,0.625)))))","v":0.625},{"$f":"BSW_S140","v":0},null,{"$f":"INT((Frame_Height-(Q21+0.5+ACHEIGHT+R21))*16+0.5)/16","v":-2.875},null,null,null,null,null,null,null,null,null,null,null,22,"11","BU"]
[null,{"$f":"IF(TSH_3001<(CDIM_3001-1.875),0,IF(AND(CDIM_3001>42,CDIM_3001<=45),13,0))","v":0},null,null,4,{"$f":"IF(TYPE4>\"\",TYPE4,\"\")","v":""},null,null,null,null,null,null,null,null,"S144",null,{"$f":"IF(OR(EXTSELECT=2,EXTSELECT=3),1.875,IF(OR(EXTSELECT=4,EXTSELECT=5),1.537,IF(EXTSELECT=7,1.818,IF(EXTSELECT=8,2,1.75))))","v":1.75},{"$f":"IF(OR(EXTSELECT=2,EXTSELECT=3),1.25,IF(EXTSELECT=4,1.0625,IF(EXTSELECT=5,1.1875,IF(EXTSELECT=7,0.4375,IF(EXTSELECT=8,1,0.625)))))","v":0.625},{"$f":"BSW_S140","v":0},null,{"$f":"INT((Frame_Height-(Q22+0.5+ACHEIGHT+R22))*16+0.5)/16","v":-2.875},null,null,null,null,null,null,null,null,null,null,null,23,"6/6","YW"]
[null,{"$f":"IF(TSH_3001<(CDIM_3001-1.875),0,IF(AND(CDIM_3001>45,CDIM_3001<=48),16,0))","v":0},null,null,1,{"$f":"VLOOKUP(TYPE,E19:F22,2,FALSE)","v":""},null,null,null,null,null,null,null,null,"S146",null,{"$f":"IF(OR(EXTSELECT=2,EXTSELECT=3),1.875,IF(OR(EXTSELECT=4,EXTSELECT=5),1.537,IF(EXTSELECT=7,1.818,IF(EXTSELECT=8,2,1.75))))","v":1.75},{"$f":"IF(OR(EXTSELECT=2,EXTSELECT=3),1.25,IF(EXTSELECT=4,1.0625,IF(EXTSELECT=5,1.1875,IF(EXTSELECT=7,0.4375,IF(EXTSELECT=8,1,0.625)))))","v":0.625},{"$f":"BSW_S140","v":0},null,{"$f":"INT((Frame_Height-(Q23+0.5+ACHEIGHT+R23))*16+0.5)/16","v":-2.875},null,null,null,null,null,null,null,null,null,null,null,24,"6/6","YW"]
[null,{"$f":"MAX(B19:B23)","v":7},null,null,null,null,null,null,null,null,null,null,null,null,"3001","2.0625",1.875,null,{"$f":"Frame_Width-4.125","v":-4.125},{"$f":"INT((Frame_Height-(P24+Q24+0.5+ACHEIGHT))*16+0.5)/16","v":-4.4375},null,null,null,null,null,null,null,null,null,null,null,null,25,"6/7","GN"]
[null,null,null,null,null,"Opening",null,null,null,null,null,null,null,null,"03A0",null,1.875,1.25,{"$f":"Frame_Width-3.125","v":-3.125},null,{"$f":"INT((Frame_Height-(Q25+0.5+ACHEIGHT+R25))*16+0.5)/16","v":-3.625},null,null,null,null,null,null,null,null,null,null,null,26,"6/7","GN"]
[null,"SHAT Error",null,null,1,"Exact Size",null,null,null,null,null,null,null,null,"1700",null,2,0.4375,{"$f":"TRUNC((Frame_Width-2.188)*32+0.5)/32","v":-2.15625},null,-2.9375,null,null,null,null,null,null,null,null,null,null,null,27,"7/7","LG"]
[null,{"$f":"IF(ISERROR(EH<6),0,IF(AND(OR(ModelNo=\"S140\",ModelNo=\"S144\",ModelNo=\"S146\"),EH<6),1,0))","v":0},null,null,2,"Rough Opening",null,null,null,null,null,null,null,null,"1720",null,2,0.4375,{"$f":"TRUNC((Frame_Width/2-2.4375)*32+0.5)/32","v":-2.40625},null,-2.9375,null,null,null,null,null,null,null,null,null,null,null,28,"7/7","LG"]
[null,"SHAT_MIN_R",null,null,1,{"$f":"VLOOKUP(RO,E26:F27,2,FALSE)","v":"Exact Size"},null,null,null,null,null,null,null,null,"1730",null,2,0.4375,{"$f":"TRUNC((Frame_Width/3-2.53125)*32+0.5)/32","v":-2.5},null,-2.9375,null,null,null,null,null,null,null,null,null,null,null,29,"7/8","OR"]
[null,{"$f":"IF(ISERROR(SHATRADIUS<B30),0,IF(AND(OR(ModelNo=\"S140\",ModelNo=\"S144\",ModelNo=\"S146\"),SHATRADIUS<B30),1,0))","v":0},null,null,null,null,null,null,null,null,null,null,null,null,"1900",null,2,1,{"$f":"TRUNC((Frame_Width-2.1875)*32+0.5)/32","v":-2.15625},null,-3.5,null,null,null,null,null,null,null,null,null,null,null,30,"7/8","OR"]
[null,{"$f":"IF(OR(ModelNo=\"S140\",ModelNo=\"S144\",ModelNo=\"S146\"),VLOOKUP(EXTSELECT,Tables!AK5:AN10,3),0)","v":0},null,null,{"$f":"IF(OR(ModelNo=\"0100\",ModelNo=\"01HP\",ModelNo=\"0102\",ModelNo=\"0103\",ModelNo=\"0104\",ModelNo=\"0109\",ModelNo=\"0151\",ModelNo=\"0152\",ModelNo=\"0153\",ModelNo=\"0154\",ModelNo=\"0155\",ModelNo=\"0170\",ModelNo=\"0171\",ModelNo=\"0172\",ModelNo=\"0173\",ModelNo=\"S174\",ModelNo=\"S175\",ModelNo=\"0179\",ModelNo=\"0301\"),1,0)","v":0},"Screen",null,null,null,null,null,null,null,null,"1920",null,2,1,{"$f":"TRUNC((Frame_Width/2-2.4375)*32+0.5)/32","v":-2.40625},null,-3.5,null,null,null,null,null,null,null,null,null,null,null,31,"8/8","WT"]
[null,"SHAT_MESSAGE",null,null,1,{"$f":"IF(SCREEN1>\"\",SCREEN1,\"\")","v":""},null,null,null,null,null,null,null,null,"1930",null,2,1,{"$f":"TRUNC((Frame_Width/3-2.53125)*32+0.5)/32","v":-2.5},null,-3.5,null,null,null,null,null,null,null,null,null,null,null,32,"8/8","WT"]
[null,{"$f":"IF(B29=1,\"R. Must be > Than \"&B30,\"\")","v":""},null,null,2,{"$f":"IF(SCREEN2>\"\",SCREEN2,\"\")","v":""},null,null,null,null,null,null,null,null,"1901",1.875,2,null,{"$f":"Frame_Width-2.1875","v":-2.1875},{"$f":"INT((Frame_Height-(P32+Q32+0.5+ACHEIGHT))*16+0.5)/16","v":-4.375},null,null,null,null,null,null,null,null,null,null,null,null,33,"8/9","NAT"]
[null,null,null,null,3,{"$f":"IF(SCREEN3>\"\",SCREEN3,\"\")","v":""},null,null,null,null,null,null,null,null,"1921",1.875,2,null,{"$f":"Frame_Width/2-2.4375","v":-2.4375},{"$f":"INT((Frame_Height-(P33+Q33+0.5+ACHEIGHT))*16+0.5)/16","v":-4.375},null,null,null,null,null,null,null,null,null,null,null,null,34,"8/9","NAT"]
[null,"LIMIT1 & LIMIT2",null,null,1,{"$f":"IF(Screen_Type=3,\"L\",IF(Screen_Type=2,\"F\",\"H\"))","v":"H"},null,null,null,null,null,null,null,null,"1931",1.875,2,null,{"$f":"Frame_Width/3-2.5","v":-2.5},{"$f":"INT((Frame_Height-(P34+Q34+0.5+ACHEIGHT))*16+0.5)/16","v":-4.375},null,null,null,null,null,null,null,null,null,null,null,null,35,"9/9","PU"]
[null,{"$f":"IF(OR(TSH>50,BSH>50),\"Sash Hgt Must be < 50\",\"\")","v":""},null,null,null,null,null,null,null,null,null,null,null,null,null,null,null,null,null,null,null,null,null,null,null,null,null,null,null,null,null,null,36,"9/9","PU"]
[null,{"$f":"IF(AND(OR(Glass<4,Glass>5),OR(TGSF>15,BGSF>15)),\"GLASS MUST BE < 15 SF\",IF(AND(OR(Glass=4,Glass=5),OR(TGSF>11,BGSF>11)),\"GLASS MUST BE <11 SF\",\"\"))","v":""},null,null,null,"Add Grid for Weight Calc",null,null,null,null,null,null,null,null,null,null,null,null,null,null,null,null,null,null,null,null,null,null,null,null,null,null,37,"9/10","BU"]
[null,null,null,null,{"$f":"IF(GRIDWEIGHT=TRUE,0.25,0)","v":0},false,null,null,null,null,null,null,null,null,null,null,null,null,null,null,null,null,null,null,null,null,null,null,null,null,null,null,38,"9/10","BU"]
[null,{"$f":"IF(AND(EXTSELECT=1,OR(SELECTEXT=\"Select Reinforcement\",SELECTEXT=\"Select Extrusion\")),\"<< Must Select\",\"\")","v":""},null,null,null,null,null,null,null,null,null,null,null,null,null,null,null,null,null,null,null,null,null,null,null,null,null,null,null,null,null,null,39,"10/10","YW"]
[null,{"$f":"IF(AND(EXT_CONTROL=0,W>0,H>0,LEG>0),\"<< Not a Valid Entry\",IF(AND(EXT_CONTROL=1,W>0,H>0,LEG=0),\"<< Need Leg Height\",IF(AND(ModelNo=\"S140\",W>0,H>0,LEG<>(Frame_Height-(Frame_Width/2))),\"<< Leg Should be\"&\" \"&(Frame_Height-(Frame_Width/2)),IF(AND(ModelNo=\"S144\",W>0,H>0,Frame_Width>(Frame_Height-LEG)),\"<< Radius Must be < than Width/2\",\"\"))))","v":""},null,null,null,null,null,null,null,null,null,null,null,null,null,null,null,null,null,null,null,null,null,null,null,null,null,null,null,null,null,null,40,"10/10","YW"]
[null,null,null,null,null,null,null,null,null,null,null,null,null,null,null,null,null,null,null,null,null,null,null,null,null,null,null,null,null,null,null,null,41,"10/11","GN"]
[null,null,null,null,null,null,null,null,null,null,null,null,null,null,null,null,null,null,null,null,null,null,null,null,null,null,null,null,null,null,null,null,42,"10/11","GN"]
[null,null,null,null,null,null,null,null,null,null,null,null,null,null,null,null,null,null,null,null,null,null,null,null,null,null,null,null,null,null,null,null,43,"11/11","LG"]
[null,null,null,null,null,null,null,null,null,null,null,null,null,null,null,null,null,null,null,null,null,null,null,null,null,null,null,null,null,null,null,null,44,"11/11","LG"]
[null,null,null,null,null,null,null,null,null,null,null,null,null,null,null,null,null,null,null,null,null,null,null,null,null,null,null,null,null,null,null,null,45,"7/8/8","OR"]
[null,null,null,null,null,null,null,null,null,null,null,null,null,null,null,null,null,null,null,null,null,null,null,null,null,null,null,null,null,null,null,null,46,"7/8/8","OR"]
[null,null,null,null,null,null,null,null,null,null,null,null,null,null,null,null,null,null,null,null,null,null,null,null,null,null,null,null,null,null,null,null,47,"8/8/8","WT"]
[null,null,null,null,null,null,null,null,null,null,null,null,null,null,null,null,null,null,null,null,null,null,null,null,null,null,null,null,null,null,null,null,48,"8/8/8","WT"]
[null,null,null,null,null,null,null,null,null,null,null,null,null,null,null,null,null,null,null,null,null,null,null,null,null,null,null,null,null,null,null,null,49,"8/8/9","BN"]
[null,null,null,null,null,null,null,null,null,null,null,null,null,null,null,null,null,null,null,null,null,null,null,null,null,null,null,null,null,null,null,null,50,"8/8/9","BN"]
[null,null,null,null,null,null,null,null,null,null,null,null,null,null,null,null,null,null,null,null,null,null,null,null,null,null,null,null,null,null,null,null,51,"8/9/9","RD"]
[null,null,null,null,null,null,null,null,null,null,null,null,null,null,null,null,null,null,null,null,null,null,null,null,null,null,null,null,null,null,null,null,52,"8/9/9","RD"]
[null,null,null,null,null,null,null,null,null,null,null,null,null,null,null,null,null,null,null,null,null,null,null,null,null,null,null,null,null,null,null,null,53,"9/9/9","NAT"]
[null,null,null,null,null,null,null,null,null,null,null,null,null,null,null,null,null,null,null,null,null,null,null,null,null,null,null,null,null,null,null,null,54,"9/9/9","NAT"]
[null,null,null,null,null,null,null,null,null,null,null,null,null,null,null,null,null,null,null,null,null,null,null,null,null,null,null,null,null,null,null,null,55,"9/9/10","BU"]
[null,null,null,null,null,null,null,null,null,null,null,null,null,null,null,null,null,null,null,null,null,null,null,null,null,null,null,null,null,null,null,null,56,"9/9/10","BU"]
[null,null,null,null,null,null,null,null,null,null,null,null,null,null,null,null,null,null,null,null,null,null,null,null,null,null,null,null,null,null,null,null,57,"9/10/10","LG"]
[null,null,null,null,null,null,null,null,null,null,null,null,null,null,null,null,null,null,null,null,null,null,null,null,null,null,null,null,null,null,null,null,58,"9/10/10","LG"]
[null,null,null,null,null,null,null,null,null,null,null,null,null,null,null,null,null,null,null,null,null,null,null,null,null,null,null,null,null,null,null,null,59,"10/10/10","WT"]
[null,null,null,null,null,null,null,null,null,null,null,null,null,null,null,null,null,null,null,null,null,null,null,null,null,null,null,null,null,null,null,null,60,"10/10/10","WT"]
[null,null,null,null,null,null,null,null,null,null,null,null,null,null,null,null,null,null,null,null,null,null,null,null,null,null,null,null,null,null,null,null,61,"10/10/11","OR"]
[null,null,null,null,null,null,null,null,null,null,null,null,null,null,null,null,null,null,null,null,null,null,null,null,null,null,null,null,null,null,null,null,62,"10/10/11","OR"]
[null,null,null,null,null,null,null,null,null,null,null,null,null,null,null,null,null,null,null,null,null,null,null,null,null,null,null,null,null,null,null,null,63,"10/11/11","BN"]
[null,null,null,null,null,null,null,null,null,null,null,null,null,null,null,null,null,null,null,null,null,null,null,null,null,null,null,null,null,null,null,null,64,"10/11/11","BN"]
[null,null,null,null,null,null,null,null,null,null,null,null,null,null,null,null,null,null,null,null,null,null,null,null,null,null,null,null,null,null,null,null,65,"11/11/11","GN"]
[null,null,null,null,null,null,null,null,null,null,null,null,null,null,null,null,null,null,null,null,null,null,null,null,null,null,null,null,null,null,null,null,66,"11/11/11","GN"]
[null,null,null,null,null,null,null,null,null,null,null,null,null,null,null,null,null,null,null,null,null,null,null,null,null,null,null,null,null,null,null,null,67,"8/8/9/9","RD"]
[null,null,null,null,null,null,null,null,null,null,null,null,null,null,null,null,null,null,null,null,null,null,null,null,null,null,null,null,null,null,null,null,68,"8/8/9/9","RD"]
[null,null,null,null,null,null,null,null,null,null,null,null,null,null,null,null,null,null,null,null,null,null,null,null,null,null,null,null,null,null,null,null,69,"8/9/9/9","YW"]
[null,null,null,null,null,null,null,null,null,null,null,null,null,null,null,null,null,null,null,null,null,null,null,null,null,null,null,null,null,null,null,null,70,"8/9/9/9","YW"]
[null,null,null,null,null,null,null,null,null,null,null,null,null,null,null,null,null,null,null,null,null,null,null,null,null,null,null,null,null,null,null,null,71,"9/9/9/9","PU"]
[null,null,null,null,null,null,null,null,null,null,null,null,null,null,null,null,null,null,null,null,null,null,null,null,null,null,null,null,null,null,null,null,72,"9/9/9/9","PU"]
[]
[]
[null,null,null,null,null,null,null,null,null,null,null,null,null,null,null,null,null,null,null,null,null,null,null,null,null,null,null,null,null,null,null,null,4,3,1]
[null,null,null,null,null,null,null,null,null,null,null,null,null,null,null,null,null,null,null,null,null,null,null,null,null,null,null,null,null,null,null,null,{"$f":"AG74+1","v":5},3,1]
[null,null,null,null,null,null,null,null,null,null,null,null,null,null,null,null,null,null,null,null,null,null,null,null,null,null,null,null,null,null,null,null,6,3,1]
[null,null,null,null,null,null,null,null,null,null,null,null,null,null,null,null,null,null,null,null,null,null,null,null,null,null,null,null,null,null,null,null,7,4,1]
[null,null,null,null,null,null,null,null,null,null,null,null,null,null,null,null,null,null,null,null,null,null,null,null,null,null,null,null,null,null,null,null,8,4,1]
[null,null,null,null,null,null,null,null,null,null,null,null,null,null,null,null,null,null,null,null,null,null,null,null,null,null,null,null,null,null,null,null,9,5,1]
[null,null,null,null,null,null,null,null,null,null,null,null,null,null,null,null,null,null,null,null,null,null,null,null,null,null,null,null,null,null,null,null,10,5,1]
[null,null,null,null,null,null,null,null,null,null,null,null,null,null,null,null,null,null,null,null,null,null,null,null,null,null,null,null,null,null,null,null,11,6,1]
[null,null,null,null,null,null,null,null,null,null,null,null,null,null,null,null,null,null,null,null,null,null,null,null,null,null,null,null,null,null,null,null,12,6,1]
[null,null,null,null,null,null,null,null,null,null,null,null,null,null,null,null,null,null,null,null,null,null,null,null,null,null,null,null,null,null,null,null,13,7,1]
[null,null,null,null,null,null,null,null,null,null,null,null,null,null,null,null,null,null,null,null,null,null,null,null,null,null,null,null,null,null,null,null,14,7,1]
[null,null,null,null,null,null,null,null,null,null,null,null,null,null,null,null,null,null,null,null,null,null,null,null,null,null,null,null,null,null,null,null,15,8,1]
[null,null,null,null,null,null,null,null,null,null,null,null,null,null,null,null,null,null,null,null,null,null,null,null,null,null,null,null,null,null,null,null,16,8,1]
[null,null,null,null,null,null,null,null,null,null,null,null,null,null,null,null,null,null,null,null,null,null,null,null,null,null,null,null,null,null,null,null,17,9,1]
[null,null,null,null,null,null,null,null,null,null,null,null,null,null,null,null,null,null,null,null,null,null,null,null,null,null,null,null,null,null,null,null,18,9,1]
[null,null,null,null,null,null,null,null,null,null,null,null,null,null,null,null,null,null,null,null,null,null,null,null,null,null,null,null,null,null,null,null,19,10,1]
[null,null,null,null,null,null,null,null,null,null,null,null,null,null,null,null,null,null,null,null,null,null,null,null,null,null,null,null,null,null,null,null,20,10,1]
[null,null,null,null,null,null,null,null,null,null,null,null,null,null,null,null,null,null,null,null,null,null,null,null,null,null,null,null,null,null,null,null,21,"11",1]
[null,null,null,null,null,null,null,null,null,null,null,null,null,null,null,null,null,null,null,null,null,null,null,null,null,null,null,null,null,null,null,null,22,"11",1]
[null,null,null,null,null,null,null,null,null,null,null,null,null,null,null,null,null,null,null,null,null,null,null,null,null,null,null,null,null,null,null,null,23,"6/6",2]
[null,null,null,null,null,null,null,null,null,null,null,null,null,null,null,null,null,null,null,null,null,null,null,null,null,null,null,null,null,null,null,null,24,"6/6",2]
[null,null,null,null,null,null,null,null,null,null,null,null,null,null,null,null,null,null,null,null,null,null,null,null,null,null,null,null,null,null,null,null,25,"6/7",2]
[null,null,null,null,null,null,null,null,null,null,null,null,null,null,null,null,null,null,null,null,null,null,null,null,null,null,null,null,null,null,null,null,26,"6/7",2]
[null,null,null,null,null,null,null,null,null,null,null,null,null,null,null,null,null,null,null,null,null,null,null,null,null,null,null,null,null,null,null,null,27,"7/7",2]
[null,null,null,null,null,null,null,null,null,null,null,null,null,null,null,null,null,null,null,null,null,null,null,null,null,null,null,null,null,null,null,null,28,"7/7",2]
[null,null,null,null,null,null,null,null,null,null,null,null,null,null,null,null,null,null,null,null,null,null,null,null,null,null,null,null,null,null,null,null,29,"7/8",2]
[null,null,null,null,null,null,null,null,null,null,null,null,null,null,null,null,null,null,null,null,null,null,null,null,null,null,null,null,null,null,null,null,30,"7/8",2]
[null,null,null,null,null,null,null,null,null,null,null,null,null,null,null,null,null,null,null,null,null,null,null,null,null,null,null,null,null,null,null,null,31,"8/8",2]
[null,null,null,null,null,null,null,null,null,null,null,null,null,null,null,null,null,null,null,null,null,null,null,null,null,null,null,null,null,null,null,null,32,"8/8",2]
[null,null,null,null,null,null,null,null,null,null,null,null,null,null,null,null,null,null,null,null,null,null,null,null,null,null,null,null,null,null,null,null,33,"8/9",2]
[null,null,null,null,null,null,null,null,null,null,null,null,null,null,null,null,null,null,null,null,null,null,null,null,null,null,null,null,null,null,null,null,34,"8/9",2]
[null,null,null,null,null,null,null,null,null,null,null,null,null,null,null,null,null,null,null,null,null,null,null,null,null,null,null,null,null,null,null,null,35,"9/9",2]
[null,null,null,null,null,null,null,null,null,null,null,null,null,null,null,null,null,null,null,null,null,null,null,null,null,null,null,null,null,null,null,null,36,"9/9",2]
[null,null,null,null,null,null,null,null,null,null,null,null,null,null,null,null,null,null,null,null,null,null,null,null,null,null,null,null,null,null,null,null,37,"9/10",2]
[null,null,null,null,null,null,null,null,null,null,null,null,null,null,null,null,null,null,null,null,null,null,null,null,null,null,null,null,null,null,null,null,38,"9/10",2]
[null,null,null,null,null,null,null,null,null,null,null,null,null,null,null,null,null,null,null,null,null,null,null,null,null,null,null,null,null,null,null,null,39,"10/10",2]
[null,null,null,null,null,null,null,null,null,null,null,null,null,null,null,null,null,null,null,null,null,null,null,null,null,null,null,null,null,null,null,null,40,"10/10",2]
[null,null,null,null,null,null,null,null,null,null,null,null,null,null,null,null,null,null,null,null,null,null,null,null,null,null,null,null,null,null,null,null,41,"10/11",2]
[null,null,null,null,null,null,null,null,null,null,null,null,null,null,null,null,null,null,null,null,null,null,null,null,null,null,null,null,null,null,null,null,42,"10/11",2]
[null,null,null,null,null,null,null,null,null,null,null,null,null,null,null,null,null,null,null,null,null,null,null,null,null,null,null,null,null,null,null,null,43,"11/11",2]
[null,null,null,null,null,null,null,null,null,null,null,null,null,null,null,null,null,null,null,null,null,null,null,null,null,null,null,null,null,null,null,null,44,"11/11",2]
[null,null,null,null,null,null,null,null,null,null,null,null,null,null,null,null,null,null,null,null,null,null,null,null,null,null,null,null,null,null,null,null,45,"8/7/8",3]
[null,null,null,null,null,null,null,null,null,null,null,null,null,null,null,null,null,null,null,null,null,null,null,null,null,null,null,null,null,null,null,null,46,"8/7/8",3]
[null,null,null,null,null,null,null,null,null,null,null,null,null,null,null,null,null,null,null,null,null,null,null,null,null,null,null,null,null,null,null,null,47,"8/8/8",3]
[null,null,null,null,null,null,null,null,null,null,null,null,null,null,null,null,null,null,null,null,null,null,null,null,null,null,null,null,null,null,null,null,48,"8/8/8",3]
[null,null,null,null,null,null,null,null,null,null,null,null,null,null,null,null,null,null,null,null,null,null,null,null,null,null,null,null,null,null,null,null,49,"8/8/9",3]
[null,null,null,null,null,null,null,null,null,null,null,null,null,null,null,null,null,null,null,null,null,null,null,null,null,null,null,null,null,null,null,null,50,"8/8/9",3]
[null,null,null,null,null,null,null,null,null,null,null,null,null,null,null,null,null,null,null,null,null,null,null,null,null,null,null,null,null,null,null,null,51,"8/9/9",3]
[null,null,null,null,null,null,null,null,null,null,null,null,null,null,null,null,null,null,null,null,null,null,null,null,null,null,null,null,null,null,null,null,52,"8/9/9",3]
[null,null,null,null,null,null,null,null,null,null,null,null,null,null,null,null,null,null,null,null,null,null,null,null,null,null,null,null,null,null,null,null,53,"9/9/9",3]
[null,null,null,null,null,null,null,null,null,null,null,null,null,null,null,null,null,null,null,null,null,null,null,null,null,null,null,null,null,null,null,null,54,"9/9/9",3]
[null,null,null,null,null,null,null,null,null,null,null,null,null,null,null,null,null,null,null,null,null,null,null,null,null,null,null,null,null,null,null,null,55,"9/9/10",3]
[null,null,null,null,null,null,null,null,null,null,null,null,null,null,null,null,null,null,null,null,null,null,null,null,null,null,null,null,null,null,null,null,56,"9/9/10",3]
[null,null,null,null,null,null,null,null,null,null,null,null,null,null,null,null,null,null,null,null,null,null,null,null,null,null,null,null,null,null,null,null,57,"9/10/10",3]
[null,null,null,null,null,null,null,null,null,null,null,null,null,null,null,null,null,null,null,null,null,null,null,null,null,null,null,null,null,null,null,null,58,"9/10/10",3]
[null,null,null,null,null,null,null,null,null,null,null,null,null,null,null,null,null,null,null,null,null,null,null,null,null,null,null,null,null,null,null,null,59,"10/10/10",3]
[null,null,null,null,null,null,null,null,null,null,null,null,null,null,null,null,null,null,null,null,null,null,null,null,null,null,null,null,null,null,null,null,60,"10/10/10",3]
[null,null,null,null,null,null,null,null,null,null,null,null,null,null,null,null,null,null,null,null,null,null,null,null,null,null,null,null,null,null,null,null,61,"10/10/11",3]
[null,null,null,null,null,null,null,null,null,null,null,null,null,null,null,null,null,null,null,null,null,null,null,null,null,null,null,null,null,null,null,null,62,"10/10/11",3]
[null,null,null,null,null,null,null,null,null,null,null,null,null,null,null,null,null,null,null,null,null,null,null,null,null,null,null,null,null,null,null,null,63,"10/11/11",3]
[null,null,null,null,null,null,null,null,null,null,null,null,null,null,null,null,null,null,null,null,null,null,null,null,null,null,null,null,null,null,null,null,64,"10/11/11",3]
[null,null,null,null,null,null,null,null,null,null,null,null,null,null,null,null,null,null,null,null,null,null,null,null,null,null,null,null,null,null,null,null,65,"11/11/11",3]
[null,null,null,null,null,null,null,null,null,null,null,null,null,null,null,null,null,null,null,null,null,null,null,null,null,null,null,null,null,null,null,null,66,"11/11/11",3]
[null,null,null,null,null,null,null,null,null,null,null,null,null,null,null,null,null,null,null,null,null,null,null,null,null,null,null,null,null,null,null,null,67,"8/8/9/9",4]
[null,null,null,null,null,null,null,null,null,null,null,null,null,null,null,null,null,null,null,null,null,null,null,null,null,null,null,null,null,null,null,null,68,"8/8/9/9",4]
[null,null,null,null,null,null,null,null,null,null,null,null,null,null,null,null,null,null,null,null,null,null,null,null,null,null,null,null,null,null,null,null,69,"8/9/9/9",4]
[null,null,null,null,null,null,null,null,null,null,null,null,null,null,null,null,null,null,null,null,null,null,null,null,null,null,null,null,null,null,null,null,70,"8/9/9/9",4]
[null,null,null,null,null,null,null,null,null,null,null,null,null,null,null,null,null,null,null,null,null,null,null,null,null,null,null,null,null,null,null,null,71,"9/9/9/9",4]
[null,null,null,null,null,null,null,null,null,null,null,null,null,null,null,null,null,null,null,null,null,null,null,null,null,null,null,null,null,null,null,null,72,"9/9/9/9",4]

{"sheet":"Data","index":3,"n_rows":630,"n_cols":81,"rows_kept":630,"cut":false,"hidden":true,"merged":[]}
[null,"Model","Description","Value"]
[{"$f":"IF(OR(ModelNo=\"0151\",ModelNo=\"0951\",ModelNo=\"9051\",ModelNo=\"8051\"),1,\"\")","v":""},"0151","Sash Width",{"$f":"Frame_Width-1.625","v":-1.625},null,{"$f":"Model_Select","v":"Select Model"},"Models","Description","W cut-back","H-cut-back","Width","Height","Min W","Min H","Max W","Max H","Max UI","Type1","Type2","Type3","Type4","Screen1","Screen2","Screen3","Ext./Reinf.","Ext./Reinf.","Ext./Reinf.","Ext./Reinf.","Ext./Reinf.","Ext./Reinf.","Ext./Reinf.","Ext./Reinf.","Glass1","Glass2","Glass3","Glass4","Glass5","Glass6","Glass7","Glass8","Opening","CDIM","DDIM","TSW","TSH","TGW","TGH","TGSF","BSW","BSH","BGW","BGH","BGSF","Bott. Sash Weight","Top Sash Weight","Bot. of Coil From CMR","Head + 4.5","Sill + CMR","EW","EH",null,null,null,null,null,null,null,null,"Triple IG calculation",null,null,null,null,null,null,null,"S140 Limitations"]
[{"$f":"IF(OR(ModelNo=\"0151\",ModelNo=\"0951\",ModelNo=\"9051\",ModelNo=\"8051\"),2,\"\")","v":""},"0151","Sash Height",{"$f":"Frame_Height-1.625","v":-1.625},null,1,"Select Model"]
[{"$f":"IF(OR(ModelNo=\"0151\",ModelNo=\"0951\",ModelNo=\"9051\",ModelNo=\"8051\"),3,\"\")","v":""},"0151","Sash Glass Width",{"$f":"Frame_Width-4.625","v":-4.625},null,2,"3001","4000 Series Double Hung",0,0,null,null,12,20,{"$f":"IF(EXTSELECT=2,48,IF(EXTSELECT=3,52,\"\"))","v":""},{"$f":"IF(EXTSELECT=2,84,IF(EXTSELECT=3,96,\"\"))","v":""},{"$f":"IF(EXTSELECT=2,126,IF(EXTSELECT=3,148,\"\"))","v":""},"Standard","Custom",null,null,"Half","Full","Locking","Select Reinforcement","Composite","Steel",null,null,null,null,null,null,"Double Strength (3 mm)","Triple Strength (5 mm)","Triple IG Single Strength","Triple IG Double Strength","Laminated",null,null,{"$f":"IF(RO=2,\"<< Exact Size Only\",\"\")","v":""},{"$f":"Frame_Height-AQ4","v":0},{"$f":"IF(TYPE=1,(Frame_Height/2),IF(TYPE=2,CMR))","v":0},{"$f":"Frame_Width-4.125","v":-4.125},{"$f":"DDIM_3001-1.625","v":-1.625},{"$f":"TRUNC((Frame_Width-5.8125)*16+0.5)/16","v":-5.75},{"$f":"TRUNC((DDIM_3001-3.25)*32+0.5)/32","v":-3.21875},{"$f":"(AT4*AU4)/144","v":0.12852647569444445},{"$f":"Frame_Width-3.125","v":-3.125},{"$f":"CDIM_3001-0.625","v":-0.625},{"$f":"TRUNC((Frame_Width-4.8125)*16+0.5)/16","v":-4.75},{"$f":"TRUNC((CDIM_3001-2.25)*32+0.5)/32","v":-2.21875},{"$f":"(AY4*AZ4)/144","v":7.3187934027777776E-2},{"$f":"BWGT_3001","v":{"$error":"#VALUE!"}},{"$f":"TWGT_3001","v":{"$error":"#VALUE!"}},{"$f":"IF(COIL=1,3.875-0.6875,3.875+((COIL-1)*1.625)-0.6875)","v":{"$error":"#N/A"}},6,1.875,{"$f":"Frame_Width-5.25","v":-5.25},{"$f":"IF(AND(AX4>36.0625,(Frame_Height/2)<=CMR),CDIM_3001-BF4-BD4-0.125,IF(OR(AND(AX4>36.0625,(Frame_Height/2)<=CMR),(Frame_Height/2)>=CMR),Frame_Height-AX4-BE4-BF4,CDIM_3001-BF4-BD4-0.125))","v":-7.25},null,null,null,1,"Single Strength (2.5 mm)",null,null,null,"SS (2.2)","DS (3.2)","4 mm","TS (5.0)",null,null,null,null,"Min. W","Min. H","Max. W","Max. H","Max. UI"]
[{"$f":"IF(OR(ModelNo=\"0151\",ModelNo=\"0951\",ModelNo=\"9051\",ModelNo=\"8051\"),4,\"\")","v":""},"0151","Sash Glass Height",{"$f":"Frame_Height-4.625","v":-4.625},null,3,"3002","4000 Series Two Lite Slider",0,0,null,null,18.5,11.25,{"$f":"IF(EXTSELECT=2,72,IF(EXTSELECT=3,96,\"\"))","v":""},{"$f":"IF(EXTSELECT=2,56,IF(EXTSELECT=3,72,\"\"))","v":""},{"$f":"IF(EXTSELECT=2,128,IF(EXTSELECT=3,156,\"\"))","v":""},"Standard",null,null,null,"Half","Full",null,"Select Reinforcement","Composite","Steel",null,null,null,null,null,null,"Double Strength (3 mm)","Triple Strength (5 mm)","Triple IG Single Strength","Triple IG Double Strength","Laminated",null,null,"",null,null,null,null,null,null,null,null,null,null,null,null,null,null,null,null,null,{"$f":"(Frame_Width/2)-4.75","v":-4.75},null,null,null,null,2,"Double Strength (3 mm)",null,null,"Max. Short",{"$f":"IF(TG2W>41,0,41)","v":41},{"$f":"IF(TG2W>56,0,56)","v":56},{"$f":"IF(TG2W>67,0,67)","v":67},{"$f":"IF(TG2W>70,0,70)","v":70},"Annealed",null,null,"Mezzo",25,40]
[{"$f":"IF(OR(ModelNo=\"0151\",ModelNo=\"0951\",ModelNo=\"9051\",ModelNo=\"8051\"),5,\"\")","v":""},"0151","Glass Area (sq.ft.)",{"$f":"(D4*D5)/144","v":0.14854600694444445},null,4,"3003","4000 Series Three Lite Slider (1/4-1/2-1/4)",0,0,null,null,47.5,11.25,{"$f":"IF(EXTSELECT=2,108,IF(EXTSELECT=3,120,\"\"))","v":""},{"$f":"IF(EXTSELECT=2,56,IF(EXTSELECT=3,72,\"\"))","v":""},{"$f":"IF(EXTSELECT=2,164,IF(EXTSELECT=3,192,\"\"))","v":""},"Standard (1/4-1/2-1/4)",null,null,null,"Half","Full",null,"Select Reinforcement","Composite","Steel",null,null,null,null,null,null,"Double Strength (3 mm)","Triple Strength (5 mm)","Triple IG Single Strength","Triple IG Double Strength","Laminated",null,null,"",null,null,null,null,null,null,null,null,null,null,null,null,null,null,null,null,null,{"$f":"(Frame_Width/4)-2.25","v":-2.25},null,null,null,null,3,"Triple Strength (5 mm)",null,null,"Max. Long",{"$f":"IF(TG2H>62,0,62)","v":62},{"$f":"IF(TG2H>76,0,76)","v":76},{"$f":"IF(TG2H>90,0,90)","v":90},{"$f":"IF(TG2H>102,0,102)","v":102},"Annealed",null,null,"Mezzo/N.F",26,41]
[{"$f":"IF(OR(ModelNo=\"0151\",ModelNo=\"0951\",ModelNo=\"9051\",ModelNo=\"8051\"),6,\"\")","v":""},"0151","Screen Width",{"$f":"Frame_Width-4","v":-4},null,5,"3004","4000 Series Picture Window",0,0,null,null,9.5,9.5,112,112,154,"Standard",null,null,null,null,null,null,null,null,null,null,null,null,null,null,null,"Double Strength (3 mm)","Triple Strength (5 mm)","Triple IG Single Strength","Triple IG Double Strength","Laminated",null,null,"",null,null,null,null,null,null,null,null,null,null,null,null,null,null,null,null,null,null,null,null,null,null,4,"Triple IG Single Strrength",null,null,"Max Sq.Ft.",{"$f":"IF(TG2A>12,0,12)","v":12},{"$f":"IF(TG2A>22,0,22)","v":22},{"$f":"IF(TG2A>32,0,32)","v":32},{"$f":"IF(TG2A>35,0,35)","v":35},"Annealed",null,null,"New Construction",20,36]
[{"$f":"IF(OR(ModelNo=\"0151\",ModelNo=\"0951\",ModelNo=\"9051\",ModelNo=\"8051\"),7,\"\")","v":""},"0151","Screen Height",{"$f":"Frame_Height-4","v":-4},null,6,"3009","4000 Series Three Lite Slider Equal Lite",0,0,null,null,37.25,11.25,{"$f":"IF(EXTSELECT=2,108,IF(EXTSELECT=3,120,\"\"))","v":""},{"$f":"IF(EXTSELECT=2,56,IF(EXTSELECT=3,72,\"\"))","v":""},{"$f":"IF(EXTSELECT=2,164,IF(EXTSELECT=3,192,\"\"))","v":""},"Standard (1/3-1/3-1/3)",null,null,null,"Half","Full",null,"Select Reinforcement","Composite","Steel",null,null,null,null,null,null,"Double Strength (3 mm)","Triple Strength (5 mm)","Triple IG Single Strength","Triple IG Double Strength","Laminated",null,null,"",null,null,null,null,null,null,null,null,null,null,null,null,null,null,null,null,null,{"$f":"(Frame_Width/3)-4.375","v":-4.375},null,null,null,null,5,"Triple IG Double Strength",null,null,"Max. Short",0,{"$f":"IF(TG2W>42,0,42)","v":42},{"$f":"IF(TG2W>70,0,70)","v":70},{"$f":"IF(TG2W>70,0,70)","v":70},"Tempered",null,null,"0700 Series",20,36]
[{"$f":"IF(OR(ModelNo=\"0151\",ModelNo=\"0951\",ModelNo=\"9051\",ModelNo=\"8051\"),8,\"\")","v":""},"0151","Awning Does not Meet Egress",null,null,7,"03A0","4000 Series Single Hung",0,0,null,null,12,22,{"$f":"IF(EXTSELECT=2,48,IF(EXTSELECT=3,52,\"\"))","v":""},{"$f":"IF(EXTSELECT=2,78,IF(EXTSELECT=3,96,\"\"))","v":""},{"$f":"IF(EXTSELECT=2,126,IF(EXTSELECT=3,148,\"\"))","v":""},"Standard","Custom",null,null,"Half","Full","Locking","Select Reinforcement","Composite","Steel",null,null,null,null,null,null,"Double Strength (3 mm)","Triple Strength (5 mm)","Triple IG Single Strength","Triple IG Double Strength","Laminated",null,null,"",{"$f":"Frame_Height-AQ9","v":0},{"$f":"IF(TYPE=1,(Frame_Height/2),IF(TYPE=2,CMR))","v":0},null,null,{"$f":"TRUNC((Frame_Width-4.75)*16+0.5)/16","v":-4.6875},{"$f":"TRUNC((DDIM_03A0-2.625)*32+0.5)/32","v":-2.59375},{"$f":"(AT9*AU9)/144","v":8.4431966145833329E-2},{"$f":"Frame_Width-3.125","v":-3.125},{"$f":"CDIM_03A0-1.125","v":-1.125},{"$f":"TRUNC((Frame_Width-4.8125)*16+0.5)/16","v":-4.75},{"$f":"TRUNC((CDIM_03A0-2.75)*32+0.5)/32","v":-2.71875},{"$f":"(AY9*AZ9)/144","v":8.9680989583333329E-2},{"$f":"BWGT_03A0","v":{"$error":"#VALUE!"}},null,{"$f":"IF(COIL=1,3.875-0.6875,3.875+((COIL-1)*1.625)-0.6875)","v":{"$error":"#N/A"}},6,1.875,{"$f":"Frame_Width-5.8125","v":-5.8125},{"$f":"IF(AND(AX9>36.0625,(Frame_Height/2)<=CMR),CDIM_03A0-BF9-BD9-0.125,IF(OR(AND(AX9>36.0625,(Frame_Height/2)<=CMR),(Frame_Height/2)>=CMR),Frame_Height-AX9-BE9-BF9,CDIM_03A0-BF9-BD9-0.125))","v":-6.75},null,null,null,6,"Laminated",null,null,"Max. Long",0,{"$f":"IF(TG2H>84,0,84)","v":84},{"$f":"IF(TG2H>129,0,129)","v":129},{"$f":"IF(TG2H>129,0,129)","v":129},"Tempered",null,null,"Fusion",23.5,38]
[{"$f":"IF(OR(ModelNo=\"0152\",ModelNo=\"0952\",ModelNo=\"9052\",ModelNo=\"8052\"),1,\"\")","v":""},"0152","Operating Sash Width",{"$f":"Frame_Width-1.625","v":-1.625},null,8,"03A2","4000 Series Two Lite Single Slider",0,0,null,null,18.5,12,{"$f":"IF(EXTSELECT=2,72,IF(EXTSELECT=3,96,\"\"))","v":""},{"$f":"IF(EXTSELECT=2,56,IF(EXTSELECT=3,72,\"\"))","v":""},{"$f":"IF(EXTSELECT=2,128,IF(EXTSELECT=3,156,\"\"))","v":""},"Standard",null,null,null,"Half","Full",null,"Select Reinforcement","Composite","Steel",null,null,null,null,null,null,"Double Strength (3 mm)","Triple Strength (5 mm)","Triple IG Single Strength","Triple IG Double Strength","Laminated",null,null,"",null,null,null,null,null,null,null,null,null,null,null,null,null,null,null,null,null,{"$f":"(Frame_Width/2)-4.75","v":-4.75},null,null,null,null,7,"HP Package",null,null,"Max Sq.Ft.",0,{"$f":"IF(TG2A>24.5,0,24.5)","v":24.5},{"$f":"IF(TG2A>42,0,42)","v":42},{"$f":"IF(TG2A>42,0,42)","v":42},"Tempered",null,null,1700,24]
[{"$f":"IF(OR(ModelNo=\"0152\",ModelNo=\"0952\",ModelNo=\"9052\",ModelNo=\"8052\"),2,\"\")","v":""},"0152","Operating Sash Height",{"$f":"(Frame_Height/2)-1.375","v":-1.375},null,9,"03A3","4000 Series Three Lite Slider (1/4-1/2-1/4)",0,0,null,null,52,12,{"$f":"IF(EXTSELECT=2,108,IF(EXTSELECT=3,110,\"\"))","v":""},{"$f":"IF(EXTSELECT=2,56,IF(EXTSELECT=3,72,\"\"))","v":""},{"$f":"IF(EXTSELECT=2,164,IF(EXTSELECT=3,182,\"\"))","v":""},"Standard (1/4-1/2-1/4)",null,null,null,"Half","Full",null,"Select Reinforcement","Composite","Steel",null,null,null,null,null,null,"Double Strength (3 mm)","Triple Strength (5 mm)","Triple IG Single Strength","Triple IG Double Strength","Laminated",null,null,"",null,null,null,null,null,null,null,null,null,null,null,null,null,null,null,null,null,{"$f":"(Frame_Width/4)-2.875","v":-2.875},null,null,null,null,8,"Impact Laminated",null,null,null,{"$f":"IF(AND(BQ5>0,BQ6>0,BQ7>0),1,0)","v":1},{"$f":"IF(AND(BR5>0,BR6>0,BR7>0),1,0)","v":1},{"$f":"IF(AND(BS5>0,BS6>0,BS7>0),1,0)","v":1},{"$f":"IF(AND(BT5>0,BT6>0,BT7>0),1,0)","v":1},{"$f":"IF(BQ11>0,\"≥SS Annealed\",IF(BR11>0,\"≥DS Annealed\",IF(BT11>0,\"TS Annealed\",\"\")))","v":"≥SS Annealed"},null,null,1900,24]
[{"$f":"IF(OR(ModelNo=\"0152\",ModelNo=\"0952\",ModelNo=\"9052\",ModelNo=\"8052\"),3,\"\")","v":""},"0152","Fixed Sash Width",{"$f":"Frame_Width-1.625","v":-1.625},null,10,"03A4","4000 Series Picture Window",0,0,null,null,9.5,9.5,112,112,154,"Standard",null,null,null,null,null,null,null,null,null,null,null,null,null,null,null,"Double Strength (3 mm)","Triple Strength (5 mm)","Triple IG Single Strength","Triple IG Double Strength","Laminated",null,null,"",null,null,null,null,null,null,null,null,null,null,null,null,null,null,null,null,null,null,null,null,null,null,null,null,null,null,null,null,{"$f":"IF(AND(BR8>0,BR9>0,BR10>0),1,0)","v":1},{"$f":"IF(AND(BS8>0,BS9>0,BS10>0),1,0)","v":1},{"$f":"IF(AND(BT8>0,BT9>0,BT10>0),1,0)","v":1},{"$f":"IF(BR12>0,\"≥DS Tempered\",IF(BT12>0,\"TS Tempered\",\"\"))","v":"≥DS Tempered"}]
[{"$f":"IF(OR(ModelNo=\"0152\",ModelNo=\"0952\",ModelNo=\"9052\",ModelNo=\"8052\"),4,\"\")","v":""},"0152","Fixed Sash Height",{"$f":"(Frame_Height/2)-1.375","v":-1.375},null,11,"03A9","4000 Series Three Lite Slider Equal Lite",0,0,null,null,52,12,{"$f":"IF(EXTSELECT=2,108,IF(EXTSELECT=3,120,\"\"))","v":""},{"$f":"IF(EXTSELECT=2,56,IF(EXTSELECT=3,72,\"\"))","v":""},{"$f":"IF(EXTSELECT=2,164,IF(EXTSELECT=3,192,\"\"))","v":""},"Standard (1/3-1/3-1/3)",null,null,null,"Half","Full",null,"Select Reinforcement","Composite","Steel",null,null,null,null,null,null,"Double Strength (3 mm)","Triple Strength (5 mm)","Triple IG Single Strength","Triple IG Double Strength","Laminated",null,null,"",null,null,null,null,null,null,null,null,null,null,null,null,null,null,null,null,null,{"$f":"(Frame_Width/3)-4.375","v":-4.375},null,null,null,null,null,null,null,null,null,"2.5 mm","3.2 mm","4 mm","5 mm"]
[{"$f":"IF(OR(ModelNo=\"0152\",ModelNo=\"0952\",ModelNo=\"9052\",ModelNo=\"8052\"),5,\"\")","v":""},"0152","Operating Sash Glass Width",{"$f":"Frame_Width-4.625","v":-4.625},null,12,"L201","2000 Series Double Hung",0,0,null,null,11,20,48,78,126,"Standard","Custom",null,null,"Half","Full","Locking",null,null,null,null,null,null,null,null,"Single Strength (2.5 mm)","Double Strength (3 mm)","Triple Strength (5 mm)",null,null,null,null,null,"",{"$f":"Frame_Height-AQ14","v":0},{"$f":"IF(TYPE=1,(Frame_Height/2),IF(TYPE=2,CMR))","v":0},{"$f":"Frame_Width-3.25","v":-3.25},{"$f":"DDIM_L201-1.5625","v":-1.5625},{"$f":"TRUNC((Frame_Width-4.9375)*16+0.5)/16","v":-4.875},{"$f":"TRUNC((DDIM_L201-3.21875)*32+0.5)/32","v":-3.1875},{"$f":"(AT14*AU14)/144","v":0.10791015625},{"$f":"Frame_Width-2.25","v":-2.25},{"$f":"CDIM_L201-0.5625","v":-0.5625},{"$f":"TRUNC((Frame_Width-3.9375)*16+0.5)/16","v":-3.875},{"$f":"TRUNC((CDIM_L201-2.21875)*32+0.5)/32","v":-2.1875},{"$f":"(AY14*AZ14)/144","v":5.8865017361111112E-2},{"$f":"BWGT_L201","v":{"$error":"#VALUE!"}},{"$f":"TWGT_L201","v":{"$error":"#VALUE!"}},{"$f":"IF(COIL=1,3.875-0.6875,3.875+((COIL-1)*1.625)-0.6875)","v":{"$error":"#N/A"}},7.4375,1.75,{"$f":"Frame_Width-4.5","v":-4.5},{"$f":"IF(AND(AX14>36.0625,(Frame_Height/2)<=CMR),CDIM_L201-BF14-BD14-0.125,IF(OR(AND(AX14>36.0625,(Frame_Height/2)<=CMR),(Frame_Height/2)>=CMR),Frame_Height-AX14-BE14-BF14,CDIM_L201-BF14-BD14-0.125))","v":-8.625},null,null,null,null,null,null,null,"Max. Short",{"$f":"IF(TG2H>41,0,41)","v":41},{"$f":"IF(TG2H>56,0,56)","v":56},{"$f":"IF(TG2H>67,0,67)","v":67},{"$f":"IF(TG2H>70,0,70)","v":70},"Annealed"]
[{"$f":"IF(OR(ModelNo=\"0152\",ModelNo=\"0952\",ModelNo=\"9052\",ModelNo=\"8052\"),6,\"\")","v":""},"0152","Operating Sash Glass Height",{"$f":"Frame_Height/2-4.375","v":-4.375},null,13,"L202","2000 Series 2 Lite Slider",0,0,null,null,18,9,84,56,140,"Standard",null,null,null,"Half","Full",null,null,null,null,null,null,null,null,null,"Single Strength (2.5 mm)","Double Strength (3 mm)","Triple Strength (5 mm)",null,null,null,null,null,"",null,null,null,null,null,null,null,null,null,null,null,null,null,null,null,null,null,{"$f":"(Frame_Width/2)-4.25","v":-4.25},null,null,null,null,null,null,null,null,"Max. Long",{"$f":"IF(TG2W>62,0,62)","v":62},{"$f":"IF(TG2W>76,0,76)","v":76},{"$f":"IF(TG2W>90,0,90)","v":90},{"$f":"IF(TG2W>102,0,102)","v":102},"Annealed"]
[{"$f":"IF(OR(ModelNo=\"0152\",ModelNo=\"0952\",ModelNo=\"9052\",ModelNo=\"8052\"),7,\"\")","v":""},"0152","Fixed Sash Glass Width",{"$f":"Frame_Width-4.625","v":-4.625},null,14,"L203","2000 Series 3 Lite Slider (1/4-1/2-1/4)",0,0,null,null,48,9,108,56,164,"Standard (1/4-1/2-1/4)",null,null,null,"Half","Full",null,null,null,null,null,null,null,null,null,"Single Strength (2.5 mm)","Double Strength (3 mm)","Triple Strength (5 mm)",null,null,null,null,null,"",null,null,null,null,null,null,null,null,null,null,null,null,null,null,null,null,null,{"$f":"(Frame_Width/4)-1.5","v":-1.5},null,null,null,null,null,null,null,null,"Max Sq.Ft.",{"$f":"IF(TG2A>12,0,12)","v":12},{"$f":"IF(TG2A>22,0,22)","v":22},{"$f":"IF(TG2A>32,0,32)","v":32},{"$f":"IF(TG2A>35,0,35)","v":35},"Annealed"]
[{"$f":"IF(OR(ModelNo=\"0152\",ModelNo=\"0952\",ModelNo=\"9052\",ModelNo=\"8052\"),8,\"\")","v":""},"0152","Fixed Sash Glass Height",{"$f":"Frame_Height/2-4.375","v":-4.375},null,15,"L204","2000 Series Picture Window",0,0,null,null,9,9,96,96,154,"Standard",null,null,null,null,null,null,null,null,null,null,null,null,null,null,null,"Double Strength (3 mm)","Triple Strength (5 mm)",null,null,null,null,null,"",null,null,null,null,null,null,null,null,null,null,null,null,null,null,null,null,null,null,null,null,null,null,null,null,null,null,"Max. Short",0,{"$f":"IF(TG2H>42,0,42)","v":42},{"$f":"IF(TG2H>70,0,70)","v":70},{"$f":"IF(TG2H>70,0,70)","v":70},"Tempered"]
[{"$f":"IF(OR(ModelNo=\"0152\",ModelNo=\"0952\",ModelNo=\"9052\",ModelNo=\"8052\"),9,\"\")","v":""},"0152","Screen Width",{"$f":"Frame_Width-4","v":-4},null,16,"L209","2000 Series 3 Lite Slider Equal Lite",0,0,null,null,38,9,108,56,164,"Standard (1/3-1/3-1/3)",null,null,null,"Half","Full",null,null,null,null,null,null,null,null,null,"Single Strength (2.5 mm)","Double Strength (3 mm)","Triple Strength (5 mm)",null,null,null,null,null,"",null,null,null,null,null,null,null,null,null,null,null,null,null,null,null,null,null,{"$f":"(TRUNC((Frame_Width/3+0.1875)*16+0.5)/16)-2.125","v":-1.9375},null,null,null,null,null,null,null,null,"Max. Long",0,{"$f":"IF(TG2W>84,0,84)","v":84},{"$f":"IF(TG2W>129,0,129)","v":129},{"$f":"IF(TG2W>129,0,129)","v":129},"Tempered"]
[{"$f":"IF(OR(ModelNo=\"0152\",ModelNo=\"0952\",ModelNo=\"9052\",ModelNo=\"8052\"),10,\"\")","v":""},"0152","Screen Height",{"$f":"(Frame_Height/2)-3.6875","v":-3.6875},null,17,"1700","New Const. Single Hung",0.5,0.5,null,null,14.25,25,52,{"$f":"IF(Frame_Width>48,84,96)","v":96},136,"Standard","Custom",null,null,"Half",null,null,"Standard","HP Package",null,null,null,null,null,null,"Single Strength (2.5 mm)","Double Strength (3 mm)","Triple Strength (5 mm)",null,null,"Laminated",null,null,"<< Select Opening",{"$f":"Frame_Height-AQ19","v":0},{"$f":"IF(TYPE=1,(Frame_Height/2),IF(TYPE=2,CMR))","v":0},null,null,{"$f":"TRUNC((Frame_Width-3.5)*32+0.5)/32","v":-3.46875},{"$f":"TRUNC((DDIM_1700-2.15625)*32+0.5)/32","v":-2.125},{"$f":"(AT19*AU19)/144","v":5.1188151041666664E-2},{"$f":"TRUNC((Frame_Width-2.188)*32+0.5)/32","v":-2.15625},{"$f":"TRUNC(((CDIM_1700-0.78125)*32+0.5))/32-0.0625","v":-0.8125},{"$f":"AW19-1.3125","v":-3.46875},{"$f":"AX19-1.3125","v":-2.125},{"$f":"(AY19*AZ19)/144","v":5.1188151041666664E-2},{"$f":"BWGT_1700","v":{"$error":"#VALUE!"}},null,null,3,4.1875,{"$f":"Frame_Width-4.625","v":-4.625},{"$f":"IF(TYPE=1,Frame_Height-CDIM_1700-BE19,IF(CMR>(Frame_Height/2),Frame_Height-CMR-BE19,IF(CMR<(Frame_Height/2),Frame_Height-AX19-BF19,0)))","v":-3},null,null,null,null,null,null,null,"Max Sq.Ft.",0,{"$f":"IF(TG2A>24.5,0,24.5)","v":24.5},{"$f":"IF(TG2A>42,0,42)","v":42},{"$f":"IF(TG2A>42,0,42)","v":42},"Tempered"]
[{"$f":"IF(OR(ModelNo=\"0152\",ModelNo=\"0952\",ModelNo=\"9052\",ModelNo=\"8052\"),11,\"\")","v":""},"0152","Awning Does not Meet Egress",null,null,18,"1702","New Const. Single Slider",0.5,0.5,null,null,23.5,14,72,72,144,"Standard","Custom",null,null,"Half",null,null,"Standard","HP Package",null,null,null,null,null,null,"Single Strength (2.5 mm)","Double Strength (3 mm)","Triple Strength (5 mm)",null,null,"Laminated",null,null,"<< Select Opening",{"$f":"Frame_Width-AQ20","v":0},{"$f":"IF(TYPE=1,(Frame_Width/2),IF(TYPE=2,CMR))","v":0},null,null,null,null,null,null,null,null,null,null,null,null,null,null,null,{"$f":"CDIM_1702-3.625","v":-3.625},null,null,null,null,null,null,null,null,null,{"$f":"IF(AND(BQ14>0,BQ15>0,BQ16>0),1,0)","v":1},{"$f":"IF(AND(BR14>0,BR15>0,BR16>0),1,0)","v":1},{"$f":"IF(AND(BS14>0,BS15>0,BS16>0),1,0)","v":1},{"$f":"IF(AND(BT14>0,BT15>0,BT16>0),1,0)","v":1},{"$f":"IF(BQ20>0,\"≥SS Annealed\",IF(BR20>0,\"≥DS Annealed\",IF(BT20>0,\"TS Annealed\",\"\")))","v":"≥SS Annealed"}]
[{"$f":"IF(OR(ModelNo=\"0153\",ModelNo=\"0953\",ModelNo=\"9053\",ModelNo=\"8053\"),1,\"\")","v":""},"0153","Operating Sash Width",{"$f":"Frame_Width-1.625","v":-1.625},null,19,"1703","New Const. 3 Lite Slider (1/4-1/2-1/4)",0.5,0.5,null,null,48.5,14,108,{"$f":"IF(Frame_Width>96,60,72)","v":72},168,"Standard",null,null,null,"Half",null,null,"Standard","HP Package",null,null,null,null,null,null,"Single Strength (2.5 mm)","Double Strength (3 mm)","Triple Strength (5 mm)",null,null,"Laminated",null,null,"<< Select Opening",null,null,null,null,null,null,null,null,null,null,null,null,null,null,null,null,null,{"$f":"(Frame_Width/4)-3.25","v":-3.25},null,null,null,null,null,null,null,null,null,null,{"$f":"IF(AND(BR17>0,BR18>0,BR19>0),1,0)","v":1},{"$f":"IF(AND(BS17>0,BS18>0,BS19>0),1,0)","v":1},{"$f":"IF(AND(BT17>0,BT18>0,BT19>0),1,0)","v":1},{"$f":"IF(BR21>0,\"≥DS Tempered\",IF(BT21>0,\"TS Tempered\",\"\"))","v":"≥DS Tempered"}]
[{"$f":"IF(OR(ModelNo=\"0153\",ModelNo=\"0953\",ModelNo=\"9053\",ModelNo=\"8053\"),2,\"\")","v":""},"0153","Operating Sash Height",{"$f":"(Frame_Height/3)-1.375","v":-1.375},null,20,"1704","New Const. Picture Window",0.5,0.5,null,null,11.5,11.5,{"$f":"IF(Frame_Height>54,84,96)","v":96},{"$f":"IF(Frame_Width>54,84,96)","v":96},156,"Standard",null,null,null,null,null,null,null,null,null,null,null,null,null,null,null,"Double Strength (3 mm)","Triple Strength (5 mm)",null,null,"Laminated",null,null,"<< Select Opening",null,null,null,null,null,null,null,null,null,null,null,null,null,null,null,null,null,null,null,null,null,null,null,null,null,null,{"$f":"IF(AND(OR(BU11=\"≥SS Annealed\",BU11=\"≥DS Annealed\",BU12=\"≥DS Tempered\",BU20=\"≥SS Annealed\",BU20=\"≥DS Annealed\",BU21=\"≥DS Tempered\")),\"TIG\",\"\")","v":"TIG"},{"$f":"IF(AND(ANNEALED1=0,ANNEALED2=0,OR(TEMPERED1>0,TEMPERED2>0)),\"Tempered is Required for TIG\",\"\")","v":""}]
[{"$f":"IF(OR(ModelNo=\"0153\",ModelNo=\"0953\",ModelNo=\"9053\",ModelNo=\"8053\"),3,\"\")","v":""},"0153","Fixed Sash Width",{"$f":"Frame_Width-1.625","v":-1.625},null,21,"1709","New Const. 3 Lite Slider (1/3-1/3-1/3)",0.5,0.5,null,null,37,14,108,{"$f":"IF(Frame_Width>96,60,72)","v":72},168,"Standard",null,null,null,"Half",null,null,"Standard","HP Package",null,null,null,null,null,null,"Single Strength (2.5 mm)","Double Strength (3 mm)","Triple Strength (5 mm)",null,null,"Laminated",null,null,"<< Select Opening",null,null,null,null,null,null,null,null,null,null,null,null,null,null,null,null,null,{"$f":"(Frame_Width/3)-2.875","v":-2.875},null,null,null,null,null,null,null,null,"Model","Width","Height","Area","Balance"]
[{"$f":"IF(OR(ModelNo=\"0153\",ModelNo=\"0953\",ModelNo=\"9053\",ModelNo=\"8053\"),4,\"\")","v":""},"0153","Fixed Sash Height",{"$f":"(2*(Frame_Height/3)-1.375)","v":-1.375},null,22,"1720","New Const. Twin Single Hung",0.5,0.5,null,null,29,25,96,84,170,"Standard","Custom",null,null,"Half",null,null,"Standard","HP Package",null,null,null,null,null,null,"Single Strength (2.5 mm)","Double Strength (3 mm)","Triple Strength (5 mm)",null,null,"Laminated",null,null,"<< Select Opening",{"$f":"Frame_Height-AQ24","v":0},{"$f":"IF(TYPE=1,(Frame_Height/2),IF(TYPE=2,CMR))","v":0},null,null,{"$f":"TRUNC((Frame_Width/2-3.75)*32+0.5)/32","v":-3.71875},{"$f":"TRUNC((DDIM_1720-2.15625)*32+0.5)/32","v":-2.125},{"$f":"(AT24*AU24)/144","v":5.4877387152777776E-2},{"$f":"TRUNC((Frame_Width/2-2.4375)*32+0.5)/32","v":-2.40625},{"$f":"TRUNC(((CDIM_1720-0.84375)*32+0.5))/32","v":-0.8125},{"$f":"TRUNC((AW24-1.3125)*32+0.5)/32","v":-3.6875},{"$f":"TRUNC((AX24-1.312)*32+0.5)/32","v":-2.09375},{"$f":"(AY24*AZ24)/144","v":5.3615993923611112E-2},{"$f":"BWGT_1700","v":{"$error":"#VALUE!"}},null,null,3,4.1875,{"$f":"(Frame_Width/2)-4.875","v":-4.875},{"$f":"IF(TYPE=1,Frame_Height-CDIM_1720-BE24,IF(CMR>(Frame_Height/2),Frame_Height-CMR-BE24,IF(CMR<(Frame_Height/2),Frame_Height-AX24-BF24,0)))","v":-3},null,null,null,null,null,null,{"$f":"IF(ModelNo=BP24,ModelNo,0)","v":0},"3001",{"$f":"MAX($D$274,$D$276)","v":-3.125},{"$f":"MAX($D$275,$D$277)","v":-0.625},{"$f":"(BQ24*BR24)/144","v":1.3563368055555556E-2},{"$f":"IF(AND(OR(Glass=4,Glass=5),OR((ISERROR((VLOOKUP(TOP_WGT,CFB,2,FALSE)))),(ISERROR((VLOOKUP(BTM_WGT,CFB,2,FALSE)))))),1,IF(AND(Glass=3,Single_ST=0),1,0))","v":0}]
[{"$f":"IF(OR(ModelNo=\"0153\",ModelNo=\"0953\",ModelNo=\"9053\",ModelNo=\"8053\"),5,\"\")","v":""},"0153","Operating Sash Glass Width",{"$f":"Frame_Width-4.625","v":-4.625},null,23,"1730","New Const. Triple Single Hung",0.5,0.5,null,null,44,25,108,84,192,"Standard","Custom",null,null,"Half",null,null,"Standard","HP Package",null,null,null,null,null,null,"Single Strength (2.5 mm)","Double Strength (3 mm)","Triple Strength (5 mm)",null,null,"Laminated",null,null,"<< Select Opening",{"$f":"Frame_Height-AQ25","v":0},{"$f":"IF(TYPE=1,(Frame_Height/2),IF(TYPE=2,CMR))","v":0},null,null,{"$f":"TRUNC((Frame_Width/3-3.84375)*32+0.5)/32","v":-3.8125},{"$f":"TRUNC((DDIM_1730-2.15625)*32+0.5)/32","v":-2.125},{"$f":"(AT25*AU25)/144","v":5.6260850694444448E-2},{"$f":"TRUNC((Frame_Width/3-2.53125)*32+0.5)/32","v":-2.5},{"$f":"TRUNC(((CDIM_1730-0.84375)*32+0.5))/32","v":-0.8125},{"$f":"TRUNC((AW25-1.34375)*32+0.5)/32","v":-3.8125},{"$f":"TRUNC((AX25-1.3125)*32+0.5)/32","v":-2.09375},{"$f":"(AY25*AZ25)/144","v":5.5433485243055552E-2},{"$f":"BWGT_1700","v":{"$error":"#VALUE!"}},null,null,3,4.1875,{"$f":"(Frame_Width/3)-4.875","v":-4.875},{"$f":"IF(TYPE=1,Frame_Height-CDIM_1730-BE25,IF(CMR>(Frame_Height/2),Frame_Height-CMR-BE25,IF(CMR<(Frame_Height/2),Frame_Height-AX25-BF25,0)))","v":-3},null,null,null,null,null,null,0,"3002",{"$f":"$D$307","v":-2.5625},{"$f":"$D$308","v":-5.4375},{"$f":"(BQ25*BR25)/144","v":9.6761067708333329E-2}]
[{"$f":"IF(OR(ModelNo=\"0153\",ModelNo=\"0953\",ModelNo=\"9053\",ModelNo=\"8053\"),6,\"\")","v":""},"0153","Operating Sash Glass Height",{"$f":"Frame_Height/3-4.375","v":-4.375},null,24,"1900","New Const. Single Hung",0.5,0.5,null,null,14.25,25,52,{"$f":"IF(Frame_Width>48,84,96)","v":96},136,"Standard","Custom",null,null,"Half",null,null,"Standard","HP Package",null,null,null,null,null,null,"Single Strength (2.5 mm)","Double Strength (3 mm)","Triple Strength (5 mm)",null,null,"Laminated",null,null,"<< Select Opening",{"$f":"Frame_Height-AQ26","v":0},{"$f":"IF(TYPE=1,(Frame_Height/2),IF(TYPE=2,CMR))","v":0},null,null,{"$f":"TRUNC((Frame_Width-3.5)*32+0.5)/32","v":-3.46875},{"$f":"TRUNC((DDIM_1900-2.157)*32+0.5)/32","v":-2.125},{"$f":"(AT26*AU26)/144","v":5.1188151041666664E-2},{"$f":"TRUNC((Frame_Width-2.1875)*32+0.5)/32","v":-2.15625},{"$f":"TRUNC(((CDIM_1900-0.844)*16+0.5))/16","v":-0.8125},{"$f":"TRUNC((AW26-1.3125)*32+0.5)/32","v":-3.4375},{"$f":"TRUNC((AX26-1.3125)*32+0.5)/32","v":-2.09375},{"$f":"(AY26*AZ26)/144","v":4.9981011284722224E-2},{"$f":"BWGT_1900","v":{"$error":"#VALUE!"}},null,null,3,4.4375,{"$f":"Frame_Width-4.625","v":-4.625},{"$f":"IF(TYPE=1,Frame_Height-CDIM_1900-BE26,IF(CMR>(Frame_Height/2),Frame_Height-CMR-BE26,IF(CMR<(Frame_Height/2),Frame_Height-AX26-BF26,0)))","v":-3},null,null,null,null,null,null,0,"3003",{"$f":"MAX($D$319,$D$321)","v":-1.4375},{"$f":"MAX($D$320,$D$322)","v":-5.4375},5.4280598958333336E-2]
[{"$f":"IF(OR(ModelNo=\"0153\",ModelNo=\"0953\",ModelNo=\"9053\",ModelNo=\"8053\"),7,\"\")","v":""},"0153","Fixed Sash Glass Width",{"$f":"Frame_Width-4.625","v":-4.625},null,25,"1901","New Const. Double Hung",0.5,0.5,null,null,16,25,52,{"$f":"IF(Frame_Width>48,76,84)","v":84},136,"Standard","Custom",null,null,"Half","Full",null,"Standard","HP Package",null,null,null,null,null,null,"Single Strength (2.5 mm)","Double Strength (3 mm)","Triple Strength (5 mm)",null,null,"Laminated",null,null,"<< Select Opening",{"$f":"Frame_Height-AQ27","v":0},{"$f":"IF(TYPE=1,(Frame_Height/2),IF(TYPE=2,CMR))","v":0},{"$f":"Frame_Width-3.4375","v":-3.4375},{"$f":"DDIM_1901-0.90625","v":-0.90625},{"$f":"AR27-1.3125","v":-4.75},{"$f":"AS27-1.3125","v":-2.21875},{"$f":"(AT27*AU27)/144","v":7.3187934027777776E-2},{"$f":"Frame_Width-2.1875","v":-2.1875},{"$f":"CDIM_1901-0.90625","v":-0.90625},{"$f":"AW27-1.3125","v":-3.5},{"$f":"AX27-1.3125","v":-2.21875},{"$f":"(AY27*AZ27)/144","v":5.3927951388888888E-2},{"$f":"BWGT_1901","v":{"$error":"#VALUE!"}},{"$f":"TWGT_1901","v":{"$error":"#VALUE!"}},null,3.5,3.125,{"$f":"Frame_Width-4.625","v":-4.625},{"$f":"IF(TYPE=1,Frame_Height-CDIM_1901-BE27,IF(CMR>(Frame_Height/2),Frame_Height-CMR-BE27,IF(CMR<(Frame_Height/2),Frame_Height-AX27-BF27,0)))","v":-3.5},null,null,null,null,null,null,0,"3004",{"$f":"$D$329","v":-4.1875},{"$f":"$D$330","v":-4.1875},0.12177191840277778]
[{"$f":"IF(OR(ModelNo=\"0153\",ModelNo=\"0953\",ModelNo=\"9053\",ModelNo=\"8053\"),8,\"\")","v":""},"0153","Fixed Sash Glass Height",{"$f":"2*(Frame_Height/3)-4.375","v":-4.375},null,26,"1902","New Const. Single Slider",0.5,0.5,null,null,23.5,14,84,{"$f":"IF(Frame_Width>72,60,72)","v":72},132,"Standard",null,null,null,"Half",null,null,"Standard","HP Package",null,null,null,null,null,null,"Single Strength (2.5 mm)","Double Strength (3 mm)","Triple Strength (5 mm)",null,null,"Laminated",null,null,"<< Select Opening",{"$f":"Frame_Width-AQ28","v":0},{"$f":"IF(TYPE=1,(Frame_Width/2),IF(TYPE=2,CMR))","v":0},null,null,null,null,null,null,null,null,null,null,null,null,null,null,null,null,null,null,null,null,null,null,null,0,"3009",{"$f":"MAX($D$337,$D$339)","v":-1.875},{"$f":"MAX($D$338,$D$340)","v":-5.4375},7.080078125E-2]
[{"$f":"IF(OR(ModelNo=\"0153\",ModelNo=\"0953\",ModelNo=\"9053\",ModelNo=\"8053\"),9,\"\")","v":""},"0153","Screen Width",{"$f":"Frame_Width-4","v":-4},null,27,"1903","New Const. 3 Lite Slider (1/4-1/2-1/4)",0.5,0.5,null,null,48.5,14,108,{"$f":"IF(Frame_Width>96,60,72)","v":72},168,"Standard",null,null,null,"Half",null,null,"Standard","HP Package",null,null,null,null,null,null,"Single Strength (2.5 mm)","Double Strength (3 mm)","Triple Strength (5 mm)",null,null,"Laminated",null,null,"<< Select Opening",null,null,null,null,null,null,null,null,null,null,null,null,null,null,null,null,null,null,null,null,null,null,null,null,null,0,"03A0",{"$f":"MAX($D$292,$D$294)","v":-4.6875},{"$f":"MAX($D$293,$D$295)","v":-2.59375},8.4431966145833329E-2,{"$f":"IF(AND(OR(Glass=4,Glass=5),(ISERROR((VLOOKUP(BTM_WGT,CFB,2,FALSE))))),1,IF(AND(Glass=3,Single_ST=0),1,0))","v":0}]
[{"$f":"IF(OR(ModelNo=\"0153\",ModelNo=\"0953\",ModelNo=\"9053\",ModelNo=\"8053\"),10,\"\")","v":""},"0153","Screen Height",{"$f":"(Frame_Height/3)-3.6875","v":-3.6875},null,28,"1904","New Const. Picture Window",0.5,0.5,null,null,11.5,11.5,{"$f":"IF(Frame_Width>54,84,96)","v":96},{"$f":"IF(Frame_Width>54,84,96)","v":96},156,"Standard",null,null,null,null,null,null,null,null,null,null,null,null,null,null,null,"Double Strength (3 mm)","Triple Strength (5 mm)",null,null,"Laminated",null,null,"<< Select Opening",null,null,null,null,null,null,null,null,null,null,null,null,null,null,null,null,null,null,null,null,null,null,null,null,null,0,"03A2",{"$f":"MAX($D$350,$D$352)","v":-2.5625},{"$f":"MAX($D$351,$D$353)","v":-4.6875},8.3414713541666671E-2]
[{"$f":"IF(OR(ModelNo=\"0153\",ModelNo=\"0953\",ModelNo=\"9053\",ModelNo=\"8053\"),11,\"\")","v":""},"0153","Awning Does not Meet Egress",null,null,29,"1909","New Const. 3 Lite Slider (1/3-1/3-1/3)",0.5,0.5,null,null,37,14,108,{"$f":"IF(Frame_Width>96,60,72)","v":72},168,"Standard",null,null,null,"Half",null,null,"Standard","HP Package",null,null,null,null,null,null,"Single Strength (2.5 mm)","Double Strength (3 mm)","Triple Strength (5 mm)",null,null,"Laminated",null,null,"<< Select Opening",null,null,null,null,null,null,null,null,null,null,null,null,null,null,null,null,null,null,null,null,null,null,null,null,null,0,"03A3",{"$f":"MAX($D$362,$D$364)","v":-1.5},{"$f":"MAX($D$363,$D$365)","v":-4.6875},4.8828125E-2]
[{"$f":"IF(OR(ModelNo=\"0154\",ModelNo=\"0954\",ModelNo=\"9054\",ModelNo=\"8054\"),1,\"\")","v":""},"0154","Operating Sash Width",{"$f":"Frame_Width-1.625","v":-1.625},null,30,"1914","New Const. Picture Window",0.5,0.5,null,null,11.5,11.5,{"$f":"IF(Frame_Width>54,84,96)","v":96},{"$f":"IF(Frame_Width>54,84,96)","v":96},156,"Standard",null,null,null,null,null,null,null,null,null,null,null,null,null,null,null,"Double Strength (3 mm)","Triple Strength (5 mm)",null,null,"Laminated",null,null,"<< Select Opening",null,null,null,null,null,null,null,null,null,null,null,null,null,null,null,null,null,null,null,null,null,null,null,null,null,0,"03A4",{"$f":"$D$329","v":-4.1875},{"$f":"$D$330","v":-4.1875},0.12177191840277778]
[{"$f":"IF(OR(ModelNo=\"0154\",ModelNo=\"0954\",ModelNo=\"9054\",ModelNo=\"8054\"),2,\"\")","v":""},"0154","Operating Sash Height",{"$f":"(Frame_Height/2)-1.375","v":-1.375},null,31,"1920","New Const. Twin Single Hung",0.5,0.5,null,null,29,25,96,84,170,"Standard","Custom",null,null,"Half",null,null,"Standard","HP Package",null,null,null,null,null,null,"Single Strength (2.5 mm)","Double Strength (3 mm)","Triple Strength (5 mm)",null,null,"Laminated",null,null,"<< Select Opening",{"$f":"Frame_Height-AQ33","v":0},{"$f":"IF(TYPE=1,(Frame_Height/2),IF(TYPE=2,CMR))","v":0},null,null,{"$f":"TRUNC((Frame_Width/2-3.75)*32+0.5)/32","v":-3.71875},{"$f":"TRUNC((DDIM_1920-2.156)*32+0.5)/32","v":-2.125},{"$f":"(AT33*AU33)/144","v":5.4877387152777776E-2},{"$f":"TRUNC((Frame_Width/2-2.4375)*32+0.5)/32","v":-2.40625},{"$f":"TRUNC(((CDIM_1920-0.8441)*16+0.5))/16","v":-0.8125},{"$f":"AW33-1.3125","v":-3.71875},-2.125,{"$f":"(AY33*AZ33)/144","v":5.4877387152777776E-2},{"$f":"BWGT_1900","v":{"$error":"#VALUE!"}},null,null,3,4.4375,{"$f":"(Frame_Width/2)-4.875","v":-4.875},{"$f":"IF(TYPE=1,Frame_Height-CDIM_1920-BE33,IF(CMR>(Frame_Height/2),Frame_Height-CMR-BE33,IF(CMR<(Frame_Height/2),Frame_Height-AX33-BF33,0)))","v":-3},null,null,null,null,null,null,0,"03A9",{"$f":"MAX($D$375,$D$377)","v":-1.875},{"$f":"MAX($D$376,$D$378)","v":-4.6875},6.103515625E-2]
[{"$f":"IF(OR(ModelNo=\"0154\",ModelNo=\"0954\",ModelNo=\"9054\",ModelNo=\"8054\"),3,\"\")","v":""},"0154","Fixed Sash Width",{"$f":"Frame_Width-1.625","v":-1.625},null,32,"1921","New Const. Twin Double Hung",0.5,0.5,null,null,36,25,96,84,170,"Standard","Custom",null,null,"Half","Full",null,"Standard","HP Package",null,null,null,null,null,null,"Single Strength (2.5 mm)","Double Strength (3 mm)","Triple Strength (5 mm)",null,null,"Laminated",null,null,"<< Select Opening",{"$f":"Frame_Height-AQ34","v":0},{"$f":"IF(TYPE=1,(Frame_Height/2),IF(TYPE=2,CMR))","v":0},{"$f":"Frame_Width/2-3.6875","v":-3.6875},{"$f":"DDIM_1901-0.90625","v":-0.90625},{"$f":"AR34-1.3125","v":-5},{"$f":"AS34-1.3125","v":-2.21875},{"$f":"(AT34*AU34)/144","v":7.7039930555555552E-2},{"$f":"Frame_Width/2-2.4375","v":-2.4375},{"$f":"CDIM_1921-0.90625","v":-0.90625},-3.75,-2.21875,{"$f":"(AY34*AZ34)/144","v":5.7779947916666664E-2},{"$f":"BWGT_1901","v":{"$error":"#VALUE!"}},{"$f":"TWGT_1901","v":{"$error":"#VALUE!"}},null,3.5,3.125,{"$f":"(Frame_Width/2)-4.875","v":-4.875},{"$f":"IF(TYPE=1,Frame_Height-CDIM_1921-BE34,IF(CMR>(Frame_Height/2),Frame_Height-CMR-BE34,IF(CMR<(Frame_Height/2),Frame_Height-AX34-BF34,0)))","v":-3.5},null,null,null,null,null,null,0,"0951",{"$f":"$D$4","v":-4.625},{"$f":"$D$5","v":-4.625},{"$f":"(BQ34*BR34)/144","v":0.14854600694444445}]
[{"$f":"IF(OR(ModelNo=\"0154\",ModelNo=\"0954\",ModelNo=\"9054\",ModelNo=\"8054\"),4,\"\")","v":""},"0154","Fixed Sash Height",{"$f":"(Frame_Height/2)-1.375","v":-1.375},null,33,"1930","New Const. Triple Single Hung",0.5,0.5,null,null,44,25,108,84,192,"Standard","Custom",null,null,"Half",null,null,"Standard","HP Package",null,null,null,null,null,null,"Single Strength (2.5 mm)","Double Strength (3 mm)","Triple Strength (5 mm)",null,null,"Laminated",null,null,"<< Select Opening",{"$f":"Frame_Height-AQ35","v":0},{"$f":"IF(TYPE=1,(Frame_Height/2),IF(TYPE=2,CMR))","v":0},null,null,{"$f":"TRUNC((Frame_Width/3-3.844)*32+0.5)/32","v":-3.8125},{"$f":"TRUNC((DDIM_1930-2.156)*32+0.5)/32","v":-2.125},{"$f":"(AT35*AU35)/144","v":5.6260850694444448E-2},{"$f":"TRUNC((Frame_Width/3-2.53125)*32+0.5)/32","v":-2.5},{"$f":"TRUNC(((CDIM_1930-0.8441)*16+0.5))/16","v":-0.8125},-3.8125,-2.125,{"$f":"(AY35*AZ35)/144","v":5.6260850694444448E-2},{"$f":"BWGT_1900","v":{"$error":"#VALUE!"}},null,null,3,4.4375,{"$f":"(Frame_Width/3)-4.875","v":-4.875},{"$f":"IF(TYPE=1,Frame_Height-CDIM_1930-BE35,IF(CMR>(Frame_Height/2),Frame_Height-CMR-BE35,IF(CMR<(Frame_Height/2),Frame_Height-AX35-BF35,0)))","v":-3},null,null,null,null,null,null,0,"0952",{"$f":"MAX($D$14,$D$16)","v":-4.625},{"$f":"MAX($D$15,$D$17)","v":-4.375},0.14051649305555555]
[{"$f":"IF(OR(ModelNo=\"0154\",ModelNo=\"0954\",ModelNo=\"9054\",ModelNo=\"8054\"),5,\"\")","v":""},"0154","Operating Sash Glass Width",{"$f":"Frame_Width-4.625","v":-4.625},null,34,"1931","New Const. Triple Double Hung",0.5,0.5,null,null,54,25,108,84,192,"Standard","Custom",null,null,"Half","Full",null,"Standard","HP Package",null,null,null,null,null,null,"Single Strength (2.5 mm)","Double Strength (3 mm)","Triple Strength (5 mm)",null,null,"Laminated",null,null,"<< Select Opening",{"$f":"Frame_Height-AQ36","v":0},{"$f":"IF(TYPE=1,(Frame_Height/2),IF(TYPE=2,CMR))","v":0},{"$f":"Frame_Width/3-3.75","v":-3.75},{"$f":"DDIM_1901-0.90625","v":-0.90625},{"$f":"AR36-1.3125","v":-5.0625},{"$f":"AS36-1.3125","v":-2.21875},{"$f":"(AT36*AU36)/144","v":7.80029296875E-2},{"$f":"Frame_Width/3-2.5","v":-2.5},{"$f":"CDIM_1931-0.90625","v":-0.90625},-3.8125,-2.21875,{"$f":"(AY36*AZ36)/144","v":5.8742947048611112E-2},{"$f":"BWGT_1901","v":{"$error":"#VALUE!"}},{"$f":"TWGT_1901","v":{"$error":"#VALUE!"}},null,3.5,3.125,{"$f":"(Frame_Width/3)-4.875","v":-4.875},{"$f":"IF(TYPE=1,Frame_Height-CDIM_1931-BE36,IF(CMR>(Frame_Height/2),Frame_Height-CMR-BE36,IF(CMR<(Frame_Height/2),Frame_Height-AX36-BF36,0)))","v":-3.5},null,null,null,null,null,null,0,"0953",{"$f":"MAX($D$25,$D$27)","v":-4.625},{"$f":"MAX($D$26,$D$28)","v":-4.375},0.14051649305555555]
[{"$f":"IF(OR(ModelNo=\"0154\",ModelNo=\"0954\",ModelNo=\"9054\",ModelNo=\"8054\"),6,\"\")","v":""},"0154","Operating Sash Glass Height",{"$f":"(Frame_Height/2)-4.375","v":-4.375},null,35,"0151","New Const. Single Vent Awning",0.5,0.5,null,null,19,16,48,48,96,"Standard",null,null,null,null,"Full",null,null,null,null,null,null,null,null,null,null,"Double Strength (3 mm)","Triple Strength (5 mm)",null,null,"Laminated",null,null,"<< Select Opening",null,null,null,null,null,null,null,null,null,null,null,null,null,null,null,null,null,null,null,null,null,null,null,null,null,0,"0954",{"$f":"MAX($D$36,$D$38)","v":-4.625},{"$f":"MAX($D$37,$D$39)","v":-4.375},0.14051649305555555]
[{"$f":"IF(OR(ModelNo=\"0154\",ModelNo=\"0954\",ModelNo=\"9054\",ModelNo=\"8054\"),7,\"\")","v":""},"0154","Fixed Sash Glass Width",{"$f":"Frame_Width-4.625","v":-4.625},null,36,"0152","New Const. Awning W/ Transom Equal Lite",0.5,0.5,null,null,19,32,48,96,144,"Standard",null,null,null,"Half",null,null,null,null,null,null,null,null,null,null,null,"Double Strength (3 mm)","Triple Strength (5 mm)",null,null,"Laminated",null,null,"<< Select Opening",null,null,null,null,null,null,null,null,null,null,null,null,null,null,null,null,null,null,null,null,null,null,null,null,null,0,"0955",{"$f":"$D$45","v":-4.625},{"$f":"$D$46","v":-4.375},0.14051649305555555]
[{"$f":"IF(OR(ModelNo=\"0154\",ModelNo=\"0954\",ModelNo=\"9054\",ModelNo=\"8054\"),8,\"\")","v":""},"0154","Fixed Sash Glass Height",{"$f":"(Frame_Height/2)-4.375","v":-4.375},null,37,"0153","New Const. Awning W/ Transom (1/3-2/3)",0.5,0.5,null,null,19,48,48,96,144,"Standard",null,null,null,"Half",null,null,null,null,null,null,null,null,null,null,null,"Double Strength (3 mm)","Triple Strength (5 mm)",null,null,"Laminated",null,null,"<< Select Opening",null,null,null,null,null,null,null,null,null,null,null,null,null,null,null,null,null,null,null,null,null,null,null,null,null,0,"0970",{"$f":"$D$50","v":-4.625},{"$f":"$D$51","v":-4.625},0.14854600694444445]
[{"$f":"IF(OR(ModelNo=\"0154\",ModelNo=\"0954\",ModelNo=\"9054\",ModelNo=\"8054\"),9,\"\")","v":""},"0154","Screen Width",{"$f":"Frame_Width-4","v":-4},null,38,"0154","New Const. Single Vent Awning W/ Bottom Transom",0.5,0.5,null,null,19,32,48,96,144,"Standard",null,null,null,"Half",null,null,null,null,null,null,null,null,null,null,null,"Double Strength (3 mm)","Triple Strength (5 mm)",null,null,"Laminated",null,null,"<< Select Opening",null,null,null,null,null,null,null,null,null,null,null,null,null,null,null,null,null,null,null,null,null,null,null,null,null,0,"B970",{"$f":"$D$50","v":-4.625},{"$f":"$D$51","v":-4.625},0.14854600694444445]
[{"$f":"IF(OR(ModelNo=\"0154\",ModelNo=\"0954\",ModelNo=\"9054\",ModelNo=\"8054\"),10,\"\")","v":""},"0154","Screen Height",{"$f":"(Frame_Height/2)-3.6875","v":-3.6875},null,39,"0155","New Const. Dual Vent Equal Lite",0.5,0.5,null,null,19,32,48,96,144,"Standard",null,null,null,"Half",null,null,null,null,null,null,null,null,null,null,null,"Double Strength (3 mm)","Triple Strength (5 mm)",null,null,"Laminated",null,null,"<< Select Opening",null,null,null,null,null,null,null,null,null,null,null,null,null,null,null,null,null,null,null,null,null,null,null,null,null,0,"0971",{"$f":"$D$55","v":-4.625},{"$f":"$D$56","v":-4.625},0.14854600694444445]
[{"$f":"IF(OR(ModelNo=\"0154\",ModelNo=\"0954\",ModelNo=\"9054\",ModelNo=\"8054\"),11,\"\")","v":""},"0154","Awning Does not Meet Egress",null,null,40,"0170","New Const. Casement Picture Window",0.5,0.5,null,null,13,11.5,96,96,154,"Standard",null,null,null,null,null,null,null,null,null,null,null,null,null,null,null,"Double Strength (3 mm)","Triple Strength (5 mm)",null,null,"Laminated",null,null,"<< Select Opening",null,null,null,null,null,null,null,null,null,null,null,null,null,null,null,null,null,null,null,null,null,null,null,null,null,0,"B971",{"$f":"$D$55","v":-4.625},{"$f":"$D$56","v":-4.625},0.14854600694444445]
[{"$f":"IF(OR(ModelNo=\"0155\",ModelNo=\"0955\",ModelNo=\"9055\",ModelNo=\"8055\"),1,\"\")","v":""},"0155","Sash Width",{"$f":"Frame_Width-1.625","v":-1.625},null,41,"0171","New Const. Single Vent Casement",0.5,0.5,null,null,16,19,36,78,114,"Standard",null,null,null,null,"Full",null,null,null,null,null,null,null,null,null,null,"Double Strength (3 mm)","Triple Strength (5 mm)",null,null,"Laminated",null,null,"<< Select Opening",null,null,null,null,null,null,null,null,null,null,null,null,null,null,null,null,null,null,null,null,null,null,null,null,null,0,"0972",{"$f":"$D$67","v":-4.375},{"$f":"$D$68","v":-4.625},0.14051649305555555]
[{"$f":"IF(OR(ModelNo=\"0155\",ModelNo=\"0955\",ModelNo=\"9055\",ModelNo=\"8055\"),2,\"\")","v":""},"0155","Sash Height",{"$f":"(Frame_Height/2)-1.375","v":-1.375},null,42,"0172","New Const. Dual Vent Casement",0.5,0.5,null,null,32,19,72,78,150,"Standard",null,null,null,"Half",null,null,null,null,null,null,null,null,null,null,null,"Double Strength (3 mm)","Triple Strength (5 mm)",null,null,"Laminated",null,null,"<< Select Opening",null,null,null,null,null,null,null,null,null,null,null,null,null,null,null,null,null,null,null,null,null,null,null,null,null,0,"0973",{"$f":"MAX($D$81,$D$83)","v":-4.125},{"$f":"MAX($D$82,$D$84)","v":-4.625},0.13248697916666666]
[{"$f":"IF(OR(ModelNo=\"0155\",ModelNo=\"0955\",ModelNo=\"9055\",ModelNo=\"8055\"),3,\"\")","v":""},"0155","Sash Glass Width",{"$f":"(Frame_Width)-4.625","v":-4.625},null,43,"0173","New Const. Dual Vent Casement (1/4-1/2-1/4)",0.5,0.5,null,null,64,19,120,78,198,"Standard (1/4-1/2-1/4)",null,null,null,"Half",null,null,null,null,null,null,null,null,null,null,null,"Double Strength (3 mm)","Triple Strength (5 mm)",null,null,"Laminated",null,null,"<< Select Opening",null,null,null,null,null,null,null,null,null,null,null,null,null,null,null,null,null,null,null,null,null,null,null,null,null,0,"0974",{"$f":"MAX($D$115,$D$117)","v":-4.25},{"$f":"MAX($D$116,$D$118)","v":-4.625},0.1365017361111111]
[{"$f":"IF(OR(ModelNo=\"0155\",ModelNo=\"0955\",ModelNo=\"9055\",ModelNo=\"8055\"),4,\"\")","v":""},"0155","Sash Glass Height",{"$f":"(Frame_Height/2)-4.375","v":-4.375},null,44,"0179","New Const. Dual Vent Casement Equal Lite",0.5,0.5,null,null,48,19,108,78,186,"Standard (1/3-1/3-1/3)",null,null,null,"Half",null,null,null,null,null,null,null,null,null,null,null,"Double Strength (3 mm)","Triple Strength (5 mm)",null,null,"Laminated",null,null,"<< Select Opening",null,null,null,null,null,null,null,null,null,null,null,null,null,null,null,null,null,null,null,null,null,null,null,null,null,0,"0975",{"$f":"MAX($D$133,$D$135)","v":-4.1875},{"$f":"MAX($D$134,$D$136)","v":-4.625},0.1344943576388889]
[{"$f":"IF(OR(ModelNo=\"0155\",ModelNo=\"0955\",ModelNo=\"9055\",ModelNo=\"8055\"),5,\"\")","v":""},"0155","Screen Width",{"$f":"Frame_Width-4","v":-4},null,45,"S174","New Construction 4 Lite Casement",0.5,0.5,null,null,64,19,120,78,198,"Standard",null,null,null,"Half",null,null,null,null,null,null,null,null,null,null,null,"Double Strength (3 mm)","Triple Strength (5 mm)",null,null,"Laminated",null,null,"<< Select Opening",null,null,null,null,null,null,null,null,null,null,null,null,null,null,null,null,null,null,null,null,null,null,null,null,null,0,"0979",{"$f":"MAX($D$98,$D$100)","v":-4.25},{"$f":"MAX($D$99,$D$101)","v":-4.625},0.1365017361111111]
[{"$f":"IF(OR(ModelNo=\"0155\",ModelNo=\"0955\",ModelNo=\"9055\",ModelNo=\"8055\"),6,\"\")","v":""},"0155","Screen Height",{"$f":"(Frame_Height/2)-3.6875","v":-3.6875},null,46,"S175","New Construction 5 Lite Casement",0.5,0.5,null,null,80,19,120,78,198,"Standard",null,null,null,"Half",null,null,null,null,null,null,null,null,null,null,null,"Double Strength (3 mm)","Triple Strength (5 mm)",null,null,"Laminated",null,null,"<< Select Opening",null,null,null,null,null,null,null,null,null,null,null,null,null,null,null,null,null,null,null,null,null,null,null,null,null,0,"6402",{"$f":"$D$236","v":-5.125},{"$f":"$D$237","v":-8.625},0.30696614583333331]
[{"$f":"IF(OR(ModelNo=\"0155\",ModelNo=\"0955\",ModelNo=\"9055\",ModelNo=\"8055\"),7,\"\")","v":""},"0155","Awning Does not Meet Egress",null,null,47,"0951","Single Vent Awning",0,0,null,null,19,16,48,48,96,"Standard",null,null,null,null,"Full",null,null,null,null,null,null,null,null,null,null,"Double Strength (3 mm)","Triple Strength (5 mm)","Triple IG Single Strength","Triple IG Double Strength","Laminated",null,null,{"$f":"IF(RO=2,\"<< Exact Size Only\",\"\")","v":""},null,null,null,null,null,null,null,null,null,null,null,null,null,null,null,null,null,null,null,null,null,null,null,null,null,0,"6403",{"$f":"$D$249","v":-5},{"$f":"$D$250","v":-8.625},0.29947916666666669]
[{"$f":"IF(OR(ModelNo=\"0170\",ModelNo=\"0970\",ModelNo=\"0504\",ModelNo=\"U504\",ModelNo=\"0614\",ModelNo=\"U614\",ModelNo=\"9070\",ModelNo=\"9014\",ModelNo=\"8070\",ModelNo=\"8014\",ModelNo=\"B970\",ModelNo=\"P970\",ModelNo=\"R970\",ModelNo=\"i970\"),1,\"\")","v":""},"0170","Glass Width",{"$f":"Frame_Width-4.625","v":-4.625},null,48,"0952","Awning W/ Transom Equal Lite",0,0,null,null,19,32,48,96,144,"Standard",null,null,null,"Half",null,null,null,null,null,null,null,null,null,null,null,"Double Strength (3 mm)","Triple Strength (5 mm)","Triple IG Single Strength","Triple IG Double Strength","Laminated",null,null,"",null,null,null,null,null,null,null,null,null,null,null,null,null,null,null,null,null,null,null,null,null,null,null,null,null,0,"6404",{"$f":"$D$264","v":-4.6875},{"$f":"$D$265","v":-8.625},0.28076171875]
[{"$f":"IF(OR(ModelNo=\"0170\",ModelNo=\"0970\",ModelNo=\"0504\",ModelNo=\"U504\",ModelNo=\"0614\",ModelNo=\"U614\",ModelNo=\"9070\",ModelNo=\"9014\",ModelNo=\"8070\",ModelNo=\"8014\",ModelNo=\"B970\",ModelNo=\"P970\",ModelNo=\"R970\",ModelNo=\"i970\"),2,\"\")","v":""},"0170","Glass Height",{"$f":"Frame_Height-4.625","v":-4.625},null,49,"0953","Awning W/ Transom (1/3-2/3)",0,0,null,null,19,48,48,96,144,"Standard",null,null,null,"Half",null,null,null,null,null,null,null,null,null,null,null,"Double Strength (3 mm)","Triple Strength (5 mm)","Triple IG Single Strength","Triple IG Double Strength","Laminated",null,null,"",null,null,null,null,null,null,null,null,null,null,null,null,null,null,null,null,null,null,null,null,null,null,null,null,null,0,"6405",{"$f":"$D$236","v":-5.125},{"$f":"$D$237","v":-8.625},0.30696614583333331]
[{"$f":"IF(OR(ModelNo=\"0170\",ModelNo=\"0970\",ModelNo=\"0504\",ModelNo=\"U504\",ModelNo=\"0614\",ModelNo=\"U614\",ModelNo=\"9070\",ModelNo=\"9014\",ModelNo=\"8070\",ModelNo=\"8014\",ModelNo=\"B970\",ModelNo=\"P970\",ModelNo=\"R970\",ModelNo=\"i970\"),3,\"\")","v":""},"0170","Glass Area (sq.ft.)",{"$f":"(D50*D51)/144","v":0.14854600694444445},null,50,"0954","Single Vent Awning W/ Bottom Transom",0,0,null,null,19,32,48,96,144,"Standard",null,null,null,"Half",null,null,null,null,null,null,null,null,null,null,null,"Double Strength (3 mm)","Triple Strength (5 mm)","Triple IG Single Strength","Triple IG Double Strength","Laminated",null,null,"",null,null,null,null,null,null,null,null,null,null,null,null,null,null,null,null,null,null,null,null,null,null,null,null,null,0,"6406",{"$f":"$D$236","v":-5.125},{"$f":"$D$237","v":-8.625},0.30696614583333331]
[{"$f":"IF(OR(ModelNo=\"0171\",ModelNo=\"0971\",ModelNo=\"9071\",ModelNo=\"8071\",ModelNo=\"B971\",ModelNo=\"P971\",ModelNo=\"R971\",ModelNo=\"i971\"),1,\"\")","v":""},"0171","Sash Width",{"$f":"Frame_Width-1.625","v":-1.625},null,51,"0955","Dual Vent Awning Equal Lite",0,0,null,null,19,32,48,96,144,"Standard",null,null,null,"Half",null,null,null,null,null,null,null,null,null,null,null,"Double Strength (3 mm)","Triple Strength (5 mm)","Triple IG Single Strength","Triple IG Double Strength","Laminated",null,null,"",null,null,null,null,null,null,null,null,null,null,null,null,null,null,null,null,null,null,null,null,null,null,null,null,null,0,"6408",{"$f":"$D$236","v":-5.125},{"$f":"$D$237","v":-8.625},0.30696614583333331]
[{"$f":"IF(OR(ModelNo=\"0171\",ModelNo=\"0971\",ModelNo=\"9071\",ModelNo=\"8071\",ModelNo=\"B971\",ModelNo=\"P971\",ModelNo=\"R971\",ModelNo=\"i971\"),2,\"\")","v":""},"0171","Sash Height",{"$f":"Frame_Height-1.625","v":-1.625},null,52,"0961","Single Vent Casement",0,0,null,null,null,null,null,null,null,"Standard",null,null,null,null,"Full",null,null,null,null,null,null,null,null,null,null,"Double Strength (3 mm)","Triple Strength (5 mm)","Triple IG Single Strength","Triple IG Double Strength","Laminated",null,null,"",null,null,null,null,null,null,null,null,null,null,null,null,null,null,null,null,null,null,null,null,null,null,null,null,null,0,"6409",{"$f":"$D$249","v":-5},{"$f":"$D$250","v":-8.625},0.29947916666666669]
[{"$f":"IF(OR(ModelNo=\"0171\",ModelNo=\"0971\",ModelNo=\"9071\",ModelNo=\"8071\",ModelNo=\"B971\",ModelNo=\"P971\",ModelNo=\"R971\",ModelNo=\"i971\"),3,\"\")","v":""},"0171","Glass Width",{"$f":"Frame_Width-4.625","v":-4.625},null,53,"0962","Dual Vent Casement",0,0,null,null,null,null,null,null,null,"Standard",null,null,null,"Half",null,null,null,null,null,null,null,null,null,null,null,"Double Strength (3 mm)","Triple Strength (5 mm)","Triple IG Single Strength","Triple IG Double Strength","Laminated",null,null,"",null,null,null,null,null,null,null,null,null,null,null,null,null,null,null,null,null,null,null,null,null,null,null,null,null,0,"6412",{"$f":"$D$264","v":-4.6875},{"$f":"$D$265","v":-8.625},0.28076171875]
[{"$f":"IF(OR(ModelNo=\"0171\",ModelNo=\"0971\",ModelNo=\"9071\",ModelNo=\"8071\",ModelNo=\"B971\",ModelNo=\"P971\",ModelNo=\"R971\",ModelNo=\"i971\"),4,\"\")","v":""},"0171","Glass Height",{"$f":"Frame_Height-4.625","v":-4.625},null,54,"0963","Dual Vent 3 Lite Casement (1/4-1/2-1/4)",0,0,null,null,null,null,null,null,null,"Standard",null,null,null,"Half",null,null,null,null,null,null,null,null,null,null,null,"Double Strength (3 mm)","Triple Strength (5 mm)","Triple IG Single Strength","Triple IG Double Strength","Laminated",null,null,"",null,null,null,null,null,null,null,null,null,null,null,null,null,null,null,null,null,null,null,null,null,null,null,null,null,{"$f":"IF(ModelNo=BP56,ModelNo,0)","v":0},"6422",{"$f":"$D$249","v":-5},{"$f":"$D$250","v":-8.625},0.29947916666666669]
[{"$f":"IF(OR(ModelNo=\"0171\",ModelNo=\"0971\",ModelNo=\"9071\",ModelNo=\"8071\",ModelNo=\"B971\",ModelNo=\"P971\",ModelNo=\"R971\",ModelNo=\"i971\"),5,\"\")","v":""},"0171","Screen Width",{"$f":"Frame_Width-4.0625","v":-4.0625},null,55,"0964","Casement Picture Window",0,0,null,null,null,null,null,null,null,"Standard",null,null,null,null,null,null,null,null,null,null,null,null,null,null,null,"Double Strength (3 mm)","Triple Strength (5 mm)","Triple IG Single Strength","Triple IG Double Strength","Laminated",null,null,"",null,null,null,null,null,null,null,null,null,null,null,null,null,null,null,null,null,null,null,null,null,null,null,null,null,0,"6475",{"$f":"$D$236","v":-5.125},{"$f":"$D$237","v":-8.625},0.30696614583333331]
[{"$f":"IF(OR(ModelNo=\"0171\",ModelNo=\"0971\",ModelNo=\"9071\",ModelNo=\"8071\",ModelNo=\"B971\",ModelNo=\"P971\",ModelNo=\"R971\",ModelNo=\"i971\"),6,\"\")","v":""},"0171","Screen Height",{"$f":"Frame_Height-4","v":-4},null,56,"0969","Dual Vent 3 Lite Casement (Equal Lite)",0,0,null,null,null,null,null,null,null,"Standard",null,null,null,"Half",null,null,null,null,null,null,null,null,null,null,null,"Double Strength (3 mm)","Triple Strength (5 mm)","Triple IG Single Strength","Triple IG Double Strength","Laminated",null,null,{"$f":"IF(RO=2,\"<< Exact Size Only\",\"\")","v":""},null,null,null,null,null,null,null,null,null,null,null,null,null,null,null,null,null,null,null,null,null,null,null,null,null,0,"8001",{"$f":"MAX(#REF!,#REF!)","v":{"$error":"#REF!"}},{"$f":"MAX(#REF!,#REF!)","v":{"$error":"#REF!"}},{"$error":"#REF!"},{"$f":"IF(AND(OR(Glass=4,Glass=5),OR((ISERROR(TOP_TUBE)),(ISERROR(BTM_TUBE)))),1,IF(AND(Glass=3,Single_ST=0),1,0))","v":0}]
[{"$f":"IF(OR(ModelNo=\"0171\",ModelNo=\"0971\",ModelNo=\"9071\",ModelNo=\"8071\",ModelNo=\"B971\",ModelNo=\"P971\",ModelNo=\"R971\",ModelNo=\"i971\"),7,\"\")","v":""},"0171","Egress Opening Width (Standard Hinge)",{"$f":"Frame_Width-11.25","v":-11.25},null,57,"0970","Casement Picture Window",0,0,null,null,13,13,96,96,154,"Standard",null,null,null,null,null,null,null,null,null,null,null,null,null,null,null,"Double Strength (3 mm)","Triple Strength (5 mm)","Triple IG Single Strength","Triple IG Double Strength","Laminated",null,null,"",null,null,null,null,null,null,null,null,null,null,null,null,null,null,null,null,null,null,null,null,null,null,null,null,null,0,"8002",{"$f":"#REF!","v":{"$error":"#REF!"}},{"$f":"#REF!","v":{"$error":"#REF!"}},{"$error":"#REF!"}]
[{"$f":"IF(OR(ModelNo=\"0171\",ModelNo=\"0971\",ModelNo=\"9071\",ModelNo=\"8071\",ModelNo=\"B971\",ModelNo=\"P971\",ModelNo=\"R971\",ModelNo=\"i971\"),8,\"\")","v":""},"0171","Egress Opening Height (Standard Hinge)",{"$f":"Frame_Height-4.375","v":-4.375},null,58,"B970","Casement Bay-Bow Picture Window",0,0,null,null,13,13,96,96,154,"Standard",null,null,null,null,null,null,null,null,null,null,null,null,null,null,null,"Double Strength (3 mm)","Triple Strength (5 mm)","Triple IG Single Strength","Triple IG Double Strength","Laminated",null,null,{"$f":"IF(RO=2,\"<< Exact Size Only\",\"\")","v":""},null,null,null,null,null,null,null,null,null,null,null,null,null,null,null,null,null,null,null,null,null,null,null,null,null,0,"8003",{"$f":"MAX(#REF!,#REF!)","v":{"$error":"#REF!"}},{"$f":"MAX(#REF!,#REF!)","v":{"$error":"#REF!"}},{"$error":"#REF!"}]
[{"$f":"IF(OR(ModelNo=\"0171\",ModelNo=\"0971\",ModelNo=\"9071\",ModelNo=\"8071\",ModelNo=\"B971\",ModelNo=\"P971\",ModelNo=\"R971\",ModelNo=\"i971\"),9,\"\")","v":""},"0171","Egress Opening Area w/Standard Hinge (sq.ft.)",{"$f":"(D59*D60)/144","v":0.341796875},null,59,"0971","Single Vent Casement",0,0,null,null,16,19,36,78,114,"Standard",null,null,null,null,"Full",null,null,null,null,null,null,null,null,null,null,"Double Strength (3 mm)","Triple Strength (5 mm)","Triple IG Single Strength","Triple IG Double Strength","Laminated",null,null,"",null,null,null,null,null,null,null,null,null,null,null,null,null,null,null,null,null,null,null,null,null,null,null,null,null,0,"8009",{"$f":"MAX(#REF!,#REF!)","v":{"$error":"#REF!"}},{"$f":"MAX(#REF!,#REF!)","v":{"$error":"#REF!"}},{"$error":"#REF!"}]
[{"$f":"IF(OR(ModelNo=\"0171\",ModelNo=\"0971\",ModelNo=\"9071\",ModelNo=\"8071\",ModelNo=\"B971\",ModelNo=\"P971\",ModelNo=\"R971\",ModelNo=\"i971\"),10,\"\")","v":""},"0171","Egress Opening Width (Egress Hinge)",{"$f":"IF(D53<22.375,\"N/A\",Frame_Width-6.8125)","v":"N/A"},null,60,"B971","Casement Bay-Bow Single Vent",0,0,null,null,16,19,36,78,114,"Standard",null,null,null,null,"Full",null,null,null,null,null,null,null,null,null,null,"Double Strength (3 mm)","Triple Strength (5 mm)","Triple IG Single Strength","Triple IG Double Strength","Laminated",null,null,"",null,null,null,null,null,null,null,null,null,null,null,null,null,null,null,null,null,null,null,null,null,null,null,null,null,0,"8014",{"$f":"$D$50","v":-4.625},{"$f":"$D$51","v":-4.625},0.14854600694444445]
[{"$f":"IF(OR(ModelNo=\"0171\",ModelNo=\"0971\",ModelNo=\"9071\",ModelNo=\"8071\",ModelNo=\"B971\",ModelNo=\"P971\",ModelNo=\"R971\",ModelNo=\"i971\"),11,\"\")","v":""},"0171","Egress Opening Height (Egress Hinge)",{"$f":"IF(D53<22.375,\"N/A\",Frame_Height-4.375)","v":"N/A"},null,61,"0972","Dual Vent Casement",0,0,null,null,32,19,72,78,150,"Standard",null,null,null,"Half",null,null,null,null,null,null,null,null,null,null,null,"Double Strength (3 mm)","Triple Strength (5 mm)","Triple IG Single Strength","Triple IG Double Strength","Laminated",null,null,"",null,null,null,null,null,null,null,null,null,null,null,null,null,null,null,null,null,null,null,null,null,null,null,null,null,0,"8051",{"$f":"$D$4","v":-4.625},{"$f":"$D$5","v":-4.625},0.14854600694444445]
[{"$f":"IF(OR(ModelNo=\"0171\",ModelNo=\"0971\",ModelNo=\"9071\",ModelNo=\"8071\",ModelNo=\"B971\",ModelNo=\"P971\",ModelNo=\"R971\",ModelNo=\"i971\"),12,\"\")","v":""},"0171","Egress Opening Area w/Egress Hinge (sq.ft.)",{"$f":"IF(D53<22.375,\"N/A\",(D62*D63)/144)","v":"N/A"},null,62,"0973","Dual Vent 3 Lite Casement (1/4-1/2-1/4)",0,0,null,null,64,19,120,78,198,"Standard (1/4-1/2-1/4)",null,null,null,"Half",null,null,null,null,null,null,null,null,null,null,null,"Double Strength (3 mm)","Triple Strength (5 mm)","Triple IG Single Strength","Triple IG Double Strength","Laminated",null,null,"",null,null,null,null,null,null,null,null,null,null,null,null,null,null,null,null,null,null,null,null,null,null,null,null,null,0,"8052",{"$f":"MAX($D$14,$D$16)","v":-4.625},{"$f":"MAX($D$15,$D$17)","v":-4.375},0.14051649305555555]
[{"$f":"IF(OR(ModelNo=\"0172\",ModelNo=\"0972\",ModelNo=\"9072\",ModelNo=\"8072\"),1,\"\")","v":""},"0172","Sash Width",{"$f":"(Frame_Width/2)-1.375","v":-1.375},null,63,"0974","4 Lite Casement",0,0,null,null,64,19,120,78,198,"Standard",null,null,null,"Half",null,null,null,null,null,null,null,null,null,null,null,"Double Strength (3 mm)","Triple Strength (5 mm)","Triple IG Single Strength","Triple IG Double Strength","Laminated",null,null,"",null,null,null,null,null,null,null,null,null,null,null,null,null,null,null,null,null,null,null,null,null,null,null,null,null,0,"8053",{"$f":"MAX($D$25,$D$27)","v":-4.625},{"$f":"MAX($D$26,$D$28)","v":-4.375},0.14051649305555555]
[{"$f":"IF(OR(ModelNo=\"0172\",ModelNo=\"0972\",ModelNo=\"9072\",ModelNo=\"8072\"),2,\"\")","v":""},"0172","Sash Height",{"$f":"Frame_Height-1.625","v":-1.625},null,64,"0975","5 Lite Casement",0,0,null,null,80,19,120,78,198,"Standard",null,null,null,"Half",null,null,null,null,null,null,null,null,null,null,null,"Double Strength (3 mm)","Triple Strength (5 mm)","Triple IG Single Strength","Triple IG Double Strength","Laminated",null,null,"",null,null,null,null,null,null,null,null,null,null,null,null,null,null,null,null,null,null,null,null,null,null,null,null,null,0,"8054",{"$f":"MAX($D$36,$D$38)","v":-4.625},{"$f":"MAX($D$37,$D$39)","v":-4.375},{"$f":"(BQ66*BR66)/144","v":0.14051649305555555}]
[{"$f":"IF(OR(ModelNo=\"0172\",ModelNo=\"0972\",ModelNo=\"9072\",ModelNo=\"8072\"),3,\"\")","v":""},"0172","Glass Width",{"$f":"(Frame_Width/2)-4.375","v":-4.375},null,65,"0979","Dual Vent 3 Lite Casement (Equal Lite)",0,0,null,null,48,19,108,78,186,"Standard (1/3-1/3-1/3)",null,null,null,"Half",null,null,null,null,null,null,null,null,null,null,null,"Double Strength (3 mm)","Triple Strength (5 mm)","Triple IG Single Strength","Triple IG Double Strength","Laminated",null,null,"",null,null,null,null,null,null,null,null,null,null,null,null,null,null,null,null,null,null,null,null,null,null,null,null,null,0,"8055",{"$f":"$D$45","v":-4.625},{"$f":"$D$46","v":-4.375},0.14051649305555555]
[{"$f":"IF(OR(ModelNo=\"0172\",ModelNo=\"0972\",ModelNo=\"9072\",ModelNo=\"8072\"),4,\"\")","v":""},"0172","Glass Height",{"$f":"Frame_Height-4.625","v":-4.625},null,66,"1105","New Const. 4 Foot Patio Door",0.625,0.5,60,80,59.375,79.5,59.375,79.5,140,"Standard",null,null,null,"Half",null,null,null,null,null,null,null,null,null,null,null,"Double Strength (3 mm)","Triple Strength (5 mm)","Triple IG Single Strength","Triple IG Double Strength","Laminated",null,null,{"$f":"IF(RO=1,\"<< Rough Opening Only\",\"\")","v":"<< Rough Opening Only"},null,null,null,null,null,null,null,null,null,null,null,null,null,null,null,null,null,null,null,null,null,null,null,null,null,0,"8070",{"$f":"$D$50","v":-4.625},{"$f":"$D$51","v":-4.625},0.14854600694444445]
[{"$f":"IF(OR(ModelNo=\"0172\",ModelNo=\"0972\",ModelNo=\"9072\",ModelNo=\"8072\"),5,\"\")","v":""},"0172","Screen Width",{"$f":"(Frame_Width/2)-3.8125","v":-3.8125},null,67,"1106","New Const. Six Foot Patio Door",0.625,0.5,72,80,71.375,79.5,71.375,95.5,168,"Standard",null,null,null,"Half",null,null,null,null,null,null,null,null,null,null,null,"Double Strength (3 mm)","Triple Strength (5 mm)","Triple IG Single Strength","Triple IG Double Strength","Laminated",null,null,"<< Rough Opening Only",null,null,null,null,null,null,null,null,null,null,null,null,null,null,null,null,null,null,null,null,null,null,null,null,null,0,"8071",{"$f":"$D$55","v":-4.625},{"$f":"$D$56","v":-4.625},0.14854600694444445]
[{"$f":"IF(OR(ModelNo=\"0172\",ModelNo=\"0972\",ModelNo=\"9072\",ModelNo=\"8072\"),6,\"\")","v":""},"0172","Screen Height",{"$f":"Frame_Height-4","v":-4},null,68,"1108","New Const. Eight Foot Patio Door",0.625,0.5,96,80,95.375,79.5,95.375,79.5,176,"Standard",null,null,null,"Half",null,null,null,null,null,null,null,null,null,null,null,"Double Strength (3 mm)","Triple Strength (5 mm)","Triple IG Single Strength","Triple IG Double Strength","Laminated",null,null,"<< Rough Opening Only",null,null,null,null,null,null,null,null,null,null,null,null,null,null,null,null,null,null,null,null,null,null,null,null,null,0,"8072",{"$f":"$D$67","v":-4.375},{"$f":"$D$68","v":-4.625},0.14051649305555555]
[{"$f":"IF(OR(ModelNo=\"0172\",ModelNo=\"0972\",ModelNo=\"9072\",ModelNo=\"8072\"),7,\"\")","v":""},"0172","Egress Opening Width (Standard Hinge)",{"$f":"(Frame_Width/2)-11","v":-11},null,69,"1109","New Const. Nine Foot Patio Door",0.625,0.5,108,80,107.375,79.5,107.375,95.5,204,"Standard",null,null,null,"Half",null,null,null,null,null,null,null,null,null,null,null,"Double Strength (3 mm)","Triple Strength (5 mm)","Triple IG Single Strength","Triple IG Double Strength","Laminated",null,null,"<< Rough Opening Only",null,null,null,null,null,null,null,null,null,null,null,null,null,null,null,null,null,null,null,null,null,null,null,null,null,0,"8073",{"$f":"MAX($D$81,$D$83)","v":-4.125},{"$f":"MAX($D$82,$D$84)","v":-4.625},0.13248697916666666]
[{"$f":"IF(OR(ModelNo=\"0172\",ModelNo=\"0972\",ModelNo=\"9072\",ModelNo=\"8072\"),8,\"\")","v":""},"0172","Egress Opening Height (Standard Hinge)",{"$f":"Frame_Height-4.375","v":-4.375},null,70,"1176","New Const. 6.5 Foot Patio Door",0.625,0.5,76,80,75.375,79.5,75.375,79.5,156,"Standard",null,null,null,"Half",null,null,null,null,null,null,null,null,null,null,null,"Double Strength (3 mm)","Triple Strength (5 mm)","Triple IG Single Strength","Triple IG Double Strength","Laminated",null,null,"<< Rough Opening Only",null,null,null,null,null,null,null,null,null,null,null,null,null,null,null,null,null,null,null,null,null,null,null,null,null,0,"8074",{"$f":"MAX($D$115,$D$117)","v":-4.25},{"$f":"MAX($D$116,$D$118)","v":-4.625},0.1365017361111111]
[{"$f":"IF(OR(ModelNo=\"0172\",ModelNo=\"0972\",ModelNo=\"9072\",ModelNo=\"8072\"),9,\"\")","v":""},"0172","Egress Opening Area w/Standard Hinge (sq.ft.)",{"$f":"(D71*D72)/144","v":0.3342013888888889},null,71,"11C5","New Const. C. Class 4 Foot Patio Door",0.5,0.5,60,80,59.5,79.5,59.5,79.5,140,"Standard",null,null,null,"Half",null,null,null,null,null,null,null,null,null,null,null,"Double Strength (3 mm)","Triple Strength (5 mm)","Triple IG Single Strength","Triple IG Double Strength","Laminated",null,null,"<< Rough Opening Only",null,null,null,null,null,null,null,null,null,null,null,null,null,null,null,null,null,null,null,null,null,null,null,null,null,0,"8075",{"$f":"MAX($D$133,$D$135)","v":-4.1875},{"$f":"MAX($D$134,$D$136)","v":-4.625},0.1344943576388889]
[{"$f":"IF(OR(ModelNo=\"0172\",ModelNo=\"0972\",ModelNo=\"9072\",ModelNo=\"8072\"),10,\"\")","v":""},"0172","Egress Opening Width (Egress Hinge)",{"$f":"IF(D65<22.375,\"N/A\",(Frame_Width/2)-6.5625)","v":"N/A"},null,72,"11C6","New Const. C. Class Six Foot Patio Door",0.5,0.5,72,80,71.5,79.5,71.5,79.5,152,"Standard",null,null,null,"Half",null,null,null,null,null,null,null,null,null,null,null,"Double Strength (3 mm)","Triple Strength (5 mm)","Triple IG Single Strength","Triple IG Double Strength","Laminated",null,null,"<< Rough Opening Only",null,null,null,null,null,null,null,null,null,null,null,null,null,null,null,null,null,null,null,null,null,null,null,null,null,0,"8079",{"$f":"MAX($D$98,$D$100)","v":-4.25},{"$f":"MAX($D$99,$D$101)","v":-4.625},0.1365017361111111]
[{"$f":"IF(OR(ModelNo=\"0172\",ModelNo=\"0972\",ModelNo=\"9072\",ModelNo=\"8072\"),11,\"\")","v":""},"0172","Egress Opening Height (Egress Hinge)",{"$f":"IF(D65<22.375,\"N/A\",Frame_Height-4.375)","v":"N/A"},null,73,"11C8","New Const. C. Class Eight Foot Patio Door",0.5,0.5,96,80,95.5,79.5,95.5,79.5,176,"Standard",null,null,null,"Half",null,null,null,null,null,null,null,null,null,null,null,"Double Strength (3 mm)","Triple Strength (5 mm)","Triple IG Single Strength","Triple IG Double Strength","Laminated",null,null,"<< Rough Opening Only",null,null,null,null,null,null,null,null,null,null,null,null,null,null,null,null,null,null,null,null,null,null,null,null,null,0,"8402",{"$f":"$D$236","v":-5.125},{"$f":"$D$237","v":-8.625},0.30696614583333331]
[{"$f":"IF(OR(ModelNo=\"0172\",ModelNo=\"0972\",ModelNo=\"9072\",ModelNo=\"8072\"),12,\"\")","v":""},"0172","Egress Opening Area w/Egress Hinge (sq.ft.)",{"$f":"IF(D65<22.375,\"N/A\",(D74*D75)/144)","v":"N/A"},null,74,"11C9","New Const. C. Class Nine Foot Patio Door",0.5,0.5,108,80,107.5,79.5,107.5,79.5,188,"Standard",null,null,null,"Half",null,null,null,null,null,null,null,null,null,null,null,"Double Strength (3 mm)","Triple Strength (5 mm)","Triple IG Single Strength","Triple IG Double Strength","Laminated",null,null,"<< Rough Opening Only",null,null,null,null,null,null,null,null,null,null,null,null,null,null,null,null,null,null,null,null,null,null,null,null,null,0,"8403",{"$f":"$D$249","v":-5},{"$f":"$D$250","v":-8.625},0.29947916666666669]
[{"$f":"IF(OR(ModelNo=\"0173\",ModelNo=\"0973\",ModelNo=\"9073\",ModelNo=\"8073\"),1,\"\")","v":""},"0173","Operating Sash Width",{"$f":"(Frame_Width/4)-1.375","v":-1.375},null,75,"5102","5100 Series Custom 2 Lite Patio Door",0,0,null,null,48,72,96,96,192,null,null,null,null,"Half",null,null,null,null,null,null,null,null,null,null,null,"Double Strength (3 mm)","Triple Strength (5 mm)","Triple IG Single Strength","Triple IG Double Strength","Laminated",null,null,{"$f":"IF(RO=2,\"<< Exact Size Only\",\"\")","v":""},null,null,null,null,null,null,null,null,null,null,null,null,null,null,null,null,null,null,null,null,null,null,null,null,null,0,"8404",{"$f":"$D$264","v":-4.6875},{"$f":"$D$265","v":-8.625},0.28076171875]
[{"$f":"IF(OR(ModelNo=\"0173\",ModelNo=\"0973\",ModelNo=\"9073\",ModelNo=\"8073\"),2,\"\")","v":""},"0173","Operating Sash Height",{"$f":"Frame_Height-1.625","v":-1.625},null,76,"5103","5100 Series Custom 3 Lite Patio Door",0,0,null,null,84,72,108,96,204,null,null,null,null,"Half",null,null,null,null,null,null,null,null,null,null,null,"Double Strength (3 mm)","Triple Strength (5 mm)","Triple IG Single Strength","Triple IG Double Strength","Laminated",null,null,{"$f":"IF(RO=2,\"<< Exact Size Only\",\"\")","v":""},null,null,null,null,null,null,null,null,null,null,null,null,null,null,null,null,null,null,null,null,null,null,null,null,null,0,"8405",{"$f":"$D$236","v":-5.125},{"$f":"$D$237","v":-8.625},0.30696614583333331]
[{"$f":"IF(OR(ModelNo=\"0173\",ModelNo=\"0973\",ModelNo=\"9073\",ModelNo=\"8073\"),3,\"\")","v":""},"0173","Fixed Sash Width",{"$f":"(Frame_Width/2)-1.125","v":-1.125},null,77,"5105","5100 Series Five Foot 2 Lite Patio Door",1.375,0.5,60,80,60,80,60,80,140,"Standard",null,null,null,"Half",null,null,null,null,null,null,null,null,null,null,null,"Double Strength (3 mm)","Triple Strength (5 mm)","Triple IG Single Strength","Triple IG Double Strength","Laminated",null,null,{"$f":"IF(RO=1,\"<< Rough Opening Only\",\"\")","v":"<< Rough Opening Only"},null,null,null,null,null,null,null,null,null,null,null,null,null,null,null,null,null,null,null,null,null,null,null,null,null,0,"8406",{"$f":"$D$236","v":-5.125},{"$f":"$D$237","v":-8.625},0.30696614583333331]
[{"$f":"IF(OR(ModelNo=\"0173\",ModelNo=\"0973\",ModelNo=\"9073\",ModelNo=\"8073\"),4,\"\")","v":""},"0173","Fixed Sash Height",{"$f":"Frame_Height-1.625","v":-1.625},null,78,"5106","5100 Series Six Foot 2 Lite Patio Door",1.375,0.5,72,80,72,80,72,80,152,"Standard",null,null,null,"Half",null,null,null,null,null,null,null,null,null,null,null,"Double Strength (3 mm)","Triple Strength (5 mm)","Triple IG Single Strength","Triple IG Double Strength","Laminated",null,null,"<< Rough Opening Only",null,null,null,null,null,null,null,null,null,null,null,null,null,null,null,null,null,null,null,null,null,null,null,null,null,0,"8408",{"$f":"$D$236","v":-5.125},{"$f":"$D$237","v":-8.625},0.30696614583333331]
[{"$f":"IF(OR(ModelNo=\"0173\",ModelNo=\"0973\",ModelNo=\"9073\",ModelNo=\"8073\"),5,\"\")","v":""},"0173","Operating Sash Glass Width",{"$f":"(Frame_Width/4)-4.375","v":-4.375},null,79,"5108","5100 Series Eight Foot 2 Lite Patio Door",1.75,0.5,96,80,96,80,96,80,176,"Standard",null,null,null,"Half",null,null,null,null,null,null,null,null,null,null,null,"Double Strength (3 mm)","Triple Strength (5 mm)","Triple IG Single Strength","Triple IG Double Strength","Laminated",null,null,"<< Rough Opening Only",null,null,null,null,null,null,null,null,null,null,null,null,null,null,null,null,null,null,null,null,null,null,null,null,null,0,"8409",{"$f":"$D$249","v":-5},{"$f":"$D$250","v":-8.625},0.29947916666666669]
[{"$f":"IF(OR(ModelNo=\"0173\",ModelNo=\"0973\",ModelNo=\"9073\",ModelNo=\"8073\"),6,\"\")","v":""},"0173","Operating Sash Glass Height",{"$f":"Frame_Height-4.625","v":-4.625},null,80,"5109","5100 Series Nine Foot 3 Lite Patio Door",2.5,0.5,108,80,108,80,108,80,188,"Standard",null,null,null,"Half",null,null,null,null,null,null,null,null,null,null,null,"Double Strength (3 mm)","Triple Strength (5 mm)","Triple IG Single Strength","Triple IG Double Strength","Laminated",null,null,"<< Rough Opening Only",null,null,null,null,null,null,null,null,null,null,null,null,null,null,null,null,null,null,null,null,null,null,null,null,null,0,"8412",{"$f":"$D$264","v":-4.6875},{"$f":"$D$265","v":-8.625},0.28076171875]
[{"$f":"IF(OR(ModelNo=\"0173\",ModelNo=\"0973\",ModelNo=\"9073\",ModelNo=\"8073\"),7,\"\")","v":""},"0173","Fixed Sash Glass Width",{"$f":"(Frame_Width/2)-4.125","v":-4.125},null,81,"5175","5100 Series Wisconsin 2 Lite Patio Door",0.5,0.5,75,80,75,80,75,80,155,"Standard",null,null,null,"Half",null,null,null,null,null,null,null,null,null,null,null,"Double Strength (3 mm)","Triple Strength (5 mm)","Triple IG Single Strength","Triple IG Double Strength","Laminated",null,null,"<< Rough Opening Only",null,null,null,null,null,null,null,null,null,null,null,null,null,null,null,null,null,null,null,null,null,null,null,null,null,0,"8422",{"$f":"$D$249","v":-5},{"$f":"$D$250","v":-8.625},0.29947916666666669]
[{"$f":"IF(OR(ModelNo=\"0173\",ModelNo=\"0973\",ModelNo=\"9073\",ModelNo=\"8073\"),8,\"\")","v":""},"0173","Fixed Sash Glass Height",{"$f":"Frame_Height-4.625","v":-4.625},null,82,"6402","6400 Series Custom 2 Lite Patio Door",0,0,null,null,48,72,96,96,192,"3\" Sash","5\" Sash","French",null,"Half",null,null,null,null,null,null,null,null,null,null,null,"Double Strength (3 mm)","Triple Strength (5 mm)","Triple IG Single Strength","Triple IG Double Strength","Laminated",null,null,{"$f":"IF(RO=2,\"<< Exact Size Only\",\"\")","v":""},null,null,null,null,null,null,null,null,null,null,null,null,null,null,null,null,null,null,null,null,null,null,null,null,null,0,"8475",{"$f":"$D$236","v":-5.125},{"$f":"$D$237","v":-8.625},0.30696614583333331]
[{"$f":"IF(OR(ModelNo=\"0173\",ModelNo=\"0973\",ModelNo=\"9073\",ModelNo=\"8073\"),9,\"\")","v":""},"0173","Screen Width",{"$f":"(Frame_Width/4)-3.8125","v":-3.8125},null,83,"6403","6400 Series Custom 3 Lite Patio Door",0,0,null,null,84,72,144,96,240,"3\" Sash","5\" Sash","French",null,"Half",null,null,null,null,null,null,null,null,null,null,null,"Double Strength (3 mm)","Triple Strength (5 mm)","Triple IG Single Strength","Triple IG Double Strength","Laminated",null,null,{"$f":"IF(RO=2,\"<< Exact Size Only\",\"\")","v":""},null,null,null,null,null,null,null,null,null,null,null,null,null,null,null,null,null,null,null,null,null,null,null,null,null,0,"R970",{"$f":"$D$50","v":-4.625},{"$f":"$D$51","v":-4.625},0.14854600694444445]
[{"$f":"IF(OR(ModelNo=\"0173\",ModelNo=\"0973\",ModelNo=\"9073\",ModelNo=\"8073\"),10,\"\")","v":""},"0173","Screen Height",{"$f":"Frame_Height-4","v":-4},null,84,"6404","6400 Series Custom 4 Lite Patio Door",0,0,null,null,96,72,144,96,240,"3\" Sash","5\" Sash","French",null,"Half",null,null,null,null,null,null,null,null,null,null,null,"Double Strength (3 mm)","Triple Strength (5 mm)","Triple IG Single Strength","Triple IG Double Strength","Laminated",null,null,{"$f":"IF(RO=2,\"<< Exact Size Only\",\"\")","v":""},null,null,null,null,null,null,null,null,null,null,null,null,null,null,null,null,null,null,null,null,null,null,null,null,null,0,"R971",{"$f":"$D$55","v":-4.625},{"$f":"$D$56","v":-4.625},0.14854600694444445]
[{"$f":"IF(OR(ModelNo=\"0173\",ModelNo=\"0973\",ModelNo=\"9073\",ModelNo=\"8073\"),11,\"\")","v":""},"0173","Egress Opening Width (Standard Hinge)",{"$f":"(Frame_Width/4)-11","v":-11},null,85,"6405","6400 Series Five Foot 2 Lite Patio Door",1.375,0.5,60,80,58.625,79.5,58.625,95.5,156,"3\" Sash","5\" Sash","French",null,"Half",null,null,null,null,null,null,null,null,null,null,null,"Double Strength (3 mm)","Triple Strength (5 mm)","Triple IG Single Strength","Triple IG Double Strength","Laminated",null,null,{"$f":"IF(RO=1,\"<< Rough Opening Only\",\"\")","v":"<< Rough Opening Only"},null,null,null,null,null,null,null,null,null,null,null,null,null,null,null,null,null,null,null,null,null,null,null,null,null,{"$f":"IF(ModelNo=BP86,ModelNo,0)","v":0},{"$f":"ModelNo","v":"Select Model"},{"$f":"IF(ISERROR(VLOOKUP(ModelNo,$BP$24:$BT$86,2,FALSE)),0,VLOOKUP(ModelNo,$BP$24:$BT$86,2,FALSE))","v":0},{"$f":"IF(ISERROR(VLOOKUP(ModelNo,$BP$24:$BT$86,3,FALSE)),0,VLOOKUP(ModelNo,$BP$24:$BT$86,3,FALSE))","v":0},{"$f":"IF(ISERROR(VLOOKUP(ModelNo,$BP$24:$BT$86,4,FALSE)),0,VLOOKUP(ModelNo,$BP$24:$BT$86,4,FALSE))","v":0},{"$f":"IF(ISERROR(VLOOKUP(ModelNo,$BP$24:$BT$86,5,FALSE)),0,VLOOKUP(ModelNo,$BP$24:$BT$86,5,FALSE))","v":0}]
[{"$f":"IF(OR(ModelNo=\"0173\",ModelNo=\"0973\",ModelNo=\"9073\",ModelNo=\"8073\"),12,\"\")","v":""},"0173","Egress Opening Height (Standard Hinge)",{"$f":"Frame_Height-4.375","v":-4.375},null,86,"6406","6400 Series Six Foot 2 Lite Patio Door",1.375,0.5,72,80,70.625,79.5,70.625,95.5,168,"3\" Sash","5\" Sash","French",null,"Half",null,null,null,null,null,null,null,null,null,null,null,"Double Strength (3 mm)","Triple Strength (5 mm)","Triple IG Single Strength","Triple IG Double Strength","Laminated",null,null,"<< Rough Opening Only"]
[{"$f":"IF(OR(ModelNo=\"0173\",ModelNo=\"0973\",ModelNo=\"9073\",ModelNo=\"8073\"),13,\"\")","v":""},"0173","Egress Opening Area w/Standard Hinge (sq.ft.)",{"$f":"(D87*D88)/144","v":0.3342013888888889},null,87,"6408","6400 Series Eight Foot 2 Lite Patio Door",1.75,0.5,96,80,94.25,79.5,94.25,95.5,190,"3\" Sash","5\" Sash","French",null,"Half",null,null,null,null,null,null,null,null,null,null,null,"Double Strength (3 mm)","Triple Strength (5 mm)","Triple IG Single Strength","Triple IG Double Strength","Laminated",null,null,"<< Rough Opening Only"]
[{"$f":"IF(OR(ModelNo=\"0173\",ModelNo=\"0973\",ModelNo=\"9073\",ModelNo=\"8073\"),14,\"\")","v":""},"0173","Egress Opening Width (Egress Hinge)",{"$f":"IF(D77<22.375,\"N/A\",(Frame_Width/4)-6.5625)","v":"N/A"},null,88,"6409","6400 Series Nine Foot 3 Lite Patio Door",2.5,0.5,108,80,105.5,79.5,105.5,95.5,204,"3\" Sash","5\" Sash","French",null,"Half",null,null,null,null,null,null,null,null,null,null,null,"Double Strength (3 mm)","Triple Strength (5 mm)","Triple IG Single Strength","Triple IG Double Strength","Laminated",null,null,"<< Rough Opening Only"]
[{"$f":"IF(OR(ModelNo=\"0173\",ModelNo=\"0973\",ModelNo=\"9073\",ModelNo=\"8073\"),15,\"\")","v":""},"0173","Egress Opening Height (Egress Hinge)",{"$f":"IF(D77<22.375,\"N/A\",Frame_Height-4.375)","v":"N/A"},null,89,"6412","6400 Series Twelve Foot 4 Lite Patio Door",4.5,0.5,144,80,139.5,79.5,139.5,95.5,240,"3\" Sash","5\" Sash","French",null,"Half",null,null,null,null,null,null,null,null,null,null,null,"Double Strength (3 mm)","Triple Strength (5 mm)","Triple IG Single Strength","Triple IG Double Strength","Laminated",null,null,"<< Rough Opening Only"]
[{"$f":"IF(OR(ModelNo=\"0173\",ModelNo=\"0973\",ModelNo=\"9073\",ModelNo=\"8073\"),16,\"\")","v":""},"0173","Egress Opening Area w/Egress Hinge (sq.ft.)",{"$f":"IF(D77<22.375,\"N/A\",(D90*D91)/144)","v":"N/A"},null,90,"6422","6400 Series Twelve Foot 3 Lite Patio Door",3.125,0.5,144,80,140.875,79.5,140.875,95.5,240,"3\" Sash","5\" Sash","French",null,"Half",null,null,null,null,null,null,null,null,null,null,null,"Double Strength (3 mm)","Triple Strength (5 mm)","Triple IG Single Strength","Triple IG Double Strength","Laminated",null,null,"<< Rough Opening Only"]
[{"$f":"IF(OR(ModelNo=\"0173\",ModelNo=\"0973\",ModelNo=\"9073\",ModelNo=\"8073\"),17,\"\")","v":""},"0173","Mull Location From Edge of Frame",{"$f":"Frame_Width/4","v":0},null,91,"6475","6400 Series Wisconsin 2 Lite Patio Door",0.5,0.5,75,80,74.5,79.5,74.5,79.5,155,"3\" Sash","5\" Sash","French",null,"Half",null,null,null,null,null,null,null,null,null,null,null,"Double Strength (3 mm)","Triple Strength (5 mm)","Triple IG Single Strength","Triple IG Double Strength","Laminated",null,null,"<< Rough Opening Only"]
[{"$f":"IF(OR(ModelNo=\"0179\",ModelNo=\"0979\",ModelNo=\"9079\",ModelNo=\"8079\"),1,\"\")","v":""},"0179","Operating Sash Width",{"$f":"TRUNC(((Frame_Width/3)-1.291)*16+0.5)/16","v":-1.25},null,121,"S140","Arched Top Single Hung (Round-Top)",0,0,null,null,{"$f":"MINR*2","v":0},43,52,96,148,"Standard","Custom",null,null,"Half",null,null,"Select Extrusion","Mezzo","Mezzo/N.F","New Construction","0700 Series","Fusion",1700,1900,null,"Double Strength (3 mm)","Triple Strength (5 mm)","Triple IG Single Strength","Triple IG Double Strength","Laminated",null,null,{"$f":"IF(RO=2,\"<< Exact Size Only\",\"\")","v":""},{"$f":"CDIM_S140","v":0},{"$f":"DDIM_S140","v":6},null,null,null,null,null,{"$f":"BSW_S140","v":0},{"$f":"BSH_S140","v":0},{"$f":"BGW_S140","v":0},{"$f":"BGH_S140","v":0},{"$f":"(BGW_S140*BGH_S140)/144","v":0},{"$f":"SW_S140","v":0},null,{"$f":"IF(COIL=1,3.875-0.6875,3.875+((COIL-1)*1.625)-0.6875)","v":{"$error":"#N/A"}},null,{"$f":"IF(OR(EXTSELECT=2,EXTSELECT=3),1.875,IF(EXTSELECT=4,1.537,IF(EXTSELECT=5,1.75,1.818)))","v":1.8180000000000001},{"$f":"IF(OR(EXTSELECT=2,EXTSELECT=3),Frame_Width-5.875,IF(EXTSELECT=4,Frame_Width-2.75,Frame_Width-4.625))","v":-4.625},{"$f":"IF(AX94>(LEG-CDIM_S140),LEG-AX94-BF94-0.125,CDIM_S140-BD94-BF94+0.16875)","v":{"$error":"#N/A"}}]
[{"$f":"IF(OR(ModelNo=\"0179\",ModelNo=\"0979\",ModelNo=\"9079\",ModelNo=\"8079\"),2,\"\")","v":""},"0179","Operating Sash Height",{"$f":"Frame_Height-1.625","v":-1.625},null,122,"S144","Arched Top Single Hung (Eyebrow)",0,0,null,null,16,43,52,96,148,"Standard","Custom",null,null,"Half",null,null,"Select Extrusion","Mezzo","Mezzo/N.F","New Construction","0700 Series","Fusion",1700,1900,null,"Double Strength (3 mm)","Triple Strength (5 mm)","Triple IG Single Strength","Triple IG Double Strength","Laminated",null,null,"",{"$f":"CDIM_S140","v":0},{"$f":"DDIM_S140","v":6},null,null,null,null,null,{"$f":"BSW_S140","v":0},{"$f":"BSH_S140","v":0},{"$f":"BGW_S140","v":0},{"$f":"BGH_S140","v":0},{"$f":"(BGW_S140*BGH_S140)/144","v":0},{"$f":"SW_S140","v":0},null,{"$f":"IF(COIL=1,3.875-0.6875,3.875+((COIL-1)*1.625)-0.6875)","v":{"$error":"#N/A"}},null,{"$f":"IF(OR(EXTSELECT=2,EXTSELECT=3),1.875,IF(EXTSELECT=4,1.537,IF(EXTSELECT=5,1.75,1.818)))","v":1.8180000000000001},{"$f":"IF(OR(EXTSELECT=2,EXTSELECT=3),Frame_Width-5.875,IF(EXTSELECT=4,Frame_Width-2.75,Frame_Width-4.625))","v":-4.625},{"$f":"IF(AX95>(LEG-CDIM_S140),LEG-AX95-BF95-0.125,CDIM_S140-BD95-BF95+0.16875)","v":{"$error":"#N/A"}}]
[{"$f":"IF(OR(ModelNo=\"0179\",ModelNo=\"0979\",ModelNo=\"9079\",ModelNo=\"8079\"),3,\"\")","v":""},"0179","Fixed Sash Width",{"$f":"TRUNC(((Frame_Width/3)-1.291)*16+0.5)/16","v":-1.25},null,123,"S146","Arched Top Single Hung (1/2 Eyebrow)",0,0,null,null,16,43,52,96,148,"Standard","Custom",null,null,"Half",null,null,"Select Extrusion","Mezzo","Mezzo/N.F","New Construction","0700 Series","Fusion",1700,1900,null,"Double Strength (3 mm)","Triple Strength (5 mm)","Triple IG Single Strength","Triple IG Double Strength","Laminated",null,null,"",{"$f":"CDIM_S140","v":0},{"$f":"DDIM_S140","v":6},null,null,null,null,null,{"$f":"BSW_S140","v":0},{"$f":"BSH_S140","v":0},{"$f":"BGW_S140","v":0},{"$f":"BGH_S140","v":0},{"$f":"(BGW_S140*BGH_S140)/144","v":0},{"$f":"SW_S140","v":0},null,{"$f":"IF(COIL=1,3.875-0.6875,3.875+((COIL-1)*1.625)-0.6875)","v":{"$error":"#N/A"}},null,{"$f":"IF(OR(EXTSELECT=2,EXTSELECT=3),1.875,IF(EXTSELECT=4,1.537,IF(EXTSELECT=5,1.75,1.818)))","v":1.8180000000000001},{"$f":"IF(OR(EXTSELECT=2,EXTSELECT=3),Frame_Width-5.875,IF(EXTSELECT=4,Frame_Width-2.75,Frame_Width-4.625))","v":-4.625},{"$f":"IF(AX96>(LEG-CDIM_S140),LEG-AX96-BF96-0.125,CDIM_S140-BD96-BF96+0.16875)","v":{"$error":"#N/A"}}]
[{"$f":"IF(OR(ModelNo=\"0179\",ModelNo=\"0979\",ModelNo=\"9079\",ModelNo=\"8079\"),4,\"\")","v":""},"0179","Fixed Sash Height",{"$f":"Frame_Height-1.625","v":-1.625},null,null,{"$f":"ModelNo","v":"Select Model"},{"$f":"VLOOKUP(Model_Select,Data,2,FALSE)","v":0},{"$f":"VLOOKUP(Model_Select,Data,3,FALSE)","v":0},{"$f":"VLOOKUP(Model_Select,Data,4,FALSE)","v":0},{"$f":"VLOOKUP(Model_Select,Data,5,FALSE)","v":0},{"$f":"VLOOKUP(Model_Select,Data,6,FALSE)","v":0},{"$f":"VLOOKUP(Model_Select,Data,7,FALSE)","v":0},{"$f":"VLOOKUP(Model_Select,Data,8,FALSE)","v":0},{"$f":"VLOOKUP(Model_Select,Data,9,FALSE)","v":0},{"$f":"VLOOKUP(Model_Select,Data,10,FALSE)","v":0},{"$f":"VLOOKUP(Model_Select,Data,11,FALSE)","v":0},{"$f":"VLOOKUP(Model_Select,Data,12,FALSE)","v":0},{"$f":"VLOOKUP(Model_Select,Data,13,FALSE)","v":0},{"$f":"VLOOKUP(Model_Select,Data,14,FALSE)","v":0},{"$f":"VLOOKUP(Model_Select,Data,15,FALSE)","v":0},{"$f":"VLOOKUP(Model_Select,Data,16,FALSE)","v":0},{"$f":"VLOOKUP(Model_Select,Data,17,FALSE)","v":0},{"$f":"VLOOKUP(Model_Select,Data,18,FALSE)","v":0},{"$f":"VLOOKUP(Model_Select,Data,19,FALSE)","v":0},{"$f":"VLOOKUP(Model_Select,Data,20,FALSE)","v":0},{"$f":"VLOOKUP(Model_Select,Data,21,FALSE)","v":0},{"$f":"VLOOKUP(Model_Select,Data,22,FALSE)","v":0},{"$f":"VLOOKUP(Model_Select,Data,23,FALSE)","v":0},{"$f":"VLOOKUP(Model_Select,Data,24,FALSE)","v":0},{"$f":"VLOOKUP(Model_Select,Data,25,FALSE)","v":0},{"$f":"VLOOKUP(Model_Select,Data,26,FALSE)","v":0},{"$f":"VLOOKUP(Model_Select,Data,27,FALSE)","v":0},{"$f":"VLOOKUP(Model_Select,Data,28,FALSE)","v":0},{"$f":"VLOOKUP(Model_Select,Data,29,FALSE)","v":0},{"$f":"VLOOKUP(Model_Select,Data,30,FALSE)","v":0},{"$f":"VLOOKUP(Model_Select,Data,31,FALSE)","v":0},{"$f":"VLOOKUP(Model_Select,Data,32,FALSE)","v":0},{"$f":"VLOOKUP(Model_Select,Data,33,FALSE)","v":0},{"$f":"VLOOKUP(Model_Select,Data,34,FALSE)","v":0},{"$f":"VLOOKUP(Model_Select,Data,35,FALSE)","v":0},{"$f":"VLOOKUP(Model_Select,Data,36,FALSE)","v":0},{"$f":"VLOOKUP(Model_Select,Data,37,FALSE)","v":0},{"$f":"VLOOKUP(Model_Select,Data,38,FALSE)","v":0},{"$f":"VLOOKUP(Model_Select,Data,39,FALSE)","v":0},{"$f":"VLOOKUP(Model_Select,Data,40,FALSE)","v":0},{"$f":"VLOOKUP(Model_Select,Data,41,FALSE)","v":0},{"$f":"VLOOKUP(Model_Select,Data,42,FALSE)","v":0},{"$f":"VLOOKUP(Model_Select,Data,43,FALSE)","v":0},{"$f":"VLOOKUP(Model_Select,Data,44,FALSE)","v":0},{"$f":"VLOOKUP(Model_Select,Data,45,FALSE)","v":0},{"$f":"VLOOKUP(Model_Select,Data,46,FALSE)","v":0},{"$f":"VLOOKUP(Model_Select,Data,47,FALSE)","v":0},{"$f":"VLOOKUP(Model_Select,Data,48,FALSE)","v":0},{"$f":"VLOOKUP(Model_Select,Data,49,FALSE)","v":0},{"$f":"VLOOKUP(Model_Select,Data,50,FALSE)","v":0},{"$f":"VLOOKUP(Model_Select,Data,51,FALSE)","v":0},{"$f":"VLOOKUP(Model_Select,Data,52,FALSE)","v":0},{"$f":"VLOOKUP(Model_Select,Data,53,FALSE)","v":0},{"$f":"VLOOKUP(Model_Select,Data,54,FALSE)","v":0}]
[{"$f":"IF(OR(ModelNo=\"0179\",ModelNo=\"0979\",ModelNo=\"9079\",ModelNo=\"8079\"),5,\"\")","v":""},"0179","Operating Sash Glass Width",{"$f":"TRUNC(((Frame_Width/3)-4.291)*16+0.5)/16","v":-4.25},null,null,{"$f":"IF(ISERROR(VLOOKUP(Model_Select,$F$188:$G$245,2,FALSE)),\"\",VLOOKUP(Model_Select,$F$188:$G$245,2,FALSE))","v":""},null,null,null,null,{"$f":"IF(OR(ModelNo=\"6405\",ModelNo=\"6406\",ModelNo=\"6408\",ModelNo=\"6409\",ModelNo=\"6412\",ModelNo=\"6422\",ModelNo=\"8405\",ModelNo=\"8406\",ModelNo=\"8408\",ModelNo=\"8409\",ModelNo=\"8412\",ModelNo=\"8422\",ModelNo=\"1106\",ModelNo=\"1109\"),1,0)","v":0},null,null,null,null,null,null,null,null,null,null,null,null,null,null,null,null,null,null,null,null,{"$f":"IF(AG97>0,1,0)","v":0},{"$f":"IF(AH97>0,1,0)","v":0},0,0,0,0,0,0]
[{"$f":"IF(OR(ModelNo=\"0179\",ModelNo=\"0979\",ModelNo=\"9079\",ModelNo=\"8079\"),6,\"\")","v":""},"0179","Operating Sash Glass Height",{"$f":"Frame_Height-4.625","v":-4.625},null,null,{"$f":"IF(ISERROR(VLOOKUP(Model_Select,$F$43:$G$73,2,FALSE)),\"\",VLOOKUP(Model_Select,$F$43:$G$73,2,FALSE))","v":""},null,null,null,null,{"$f":"IF(HCONTROL=1,96,\"\")","v":""},null,null,null,null,null,null,null,null,null,null,null,null,null,null,null,null,null,null,null,null,{"$f":"AG98","v":0},{"$f":"SUM(AG98:AH98)","v":0},{"$f":"SUM(AG98:AI98)","v":0},{"$f":"SUM(AG98:AJ98)","v":0},{"$f":"SUM(AG98:AK98)","v":0},{"$f":"SUM(AG98:AL98)","v":0},{"$f":"SUM(AG98:AM98)","v":0},{"$f":"SUM(AG98:AN98)","v":0}]
[{"$f":"IF(OR(ModelNo=\"0179\",ModelNo=\"0979\",ModelNo=\"9079\",ModelNo=\"8079\"),7,\"\")","v":""},"0179","Fixed Sash Glass Width",{"$f":"TRUNC(((Frame_Width/3)-4.291)*16+0.5)/16","v":-4.25},null,null,{"$f":"IF(OR(Model_Select=\"S140\",Model_Select=\"S144\",Model_Select=\"S146\"),1,0)","v":0},null,null,null,null,null,null,null,null,null,null,null,null,null,null,null,null,null,null,null,null,null,null,null,null,null,{"$f":"AG97","v":0},0,0,0,0,0,0,0]
[{"$f":"IF(OR(ModelNo=\"0179\",ModelNo=\"0979\",ModelNo=\"9079\",ModelNo=\"8079\"),8,\"\")","v":""},"0179","Fixed Sash Glass Height",{"$f":"Frame_Height-4.625","v":-4.625},null,null,null,null,null,null,null,null,null,null,null,null,null,null,null,null,null,null,null,null,null,null,null,null,null,null,null,null,{"$f":"IF(ISERROR(HLOOKUP(1,AG99:AN100,2,FALSE)),\"\",HLOOKUP(1,AG99:AN100,2,FALSE))","v":""},{"$f":"IF(ISERROR(HLOOKUP(2,AG99:AN100,2,FALSE)),\"\",HLOOKUP(2,AG99:AN100,2,FALSE))","v":""},{"$f":"IF(ISERROR(HLOOKUP(3,AG99:AN100,2,FALSE)),\"\",HLOOKUP(3,AG99:AN100,2,FALSE))","v":""},{"$f":"IF(ISERROR(HLOOKUP(4,AG99:AN100,2,FALSE)),\"\",HLOOKUP(4,AG99:AN100,2,FALSE))","v":""},{"$f":"IF(ISERROR(HLOOKUP(5,AG99:AN100,2,FALSE)),\"\",HLOOKUP(5,AG99:AN100,2,FALSE))","v":""},{"$f":"IF(ISERROR(HLOOKUP(6,AG99:AN100,2,FALSE)),\"\",HLOOKUP(6,AG99:AN100,2,FALSE))","v":""},{"$f":"IF(ISERROR(HLOOKUP(7,AG99:AN100,2,FALSE)),\"\",HLOOKUP(7,AG99:AN100,2,FALSE))","v":""},{"$f":"IF(ISERROR(HLOOKUP(8,AG99:AN100,2,FALSE)),\"\",HLOOKUP(8,AG99:AN100,2,FALSE))","v":""}]
[{"$f":"IF(OR(ModelNo=\"0179\",ModelNo=\"0979\",ModelNo=\"9079\",ModelNo=\"8079\"),9,\"\")","v":""},"0179","Screen Width",{"$f":"TRUNC(((Frame_Width/3)-3.666)*32+0.5)/32","v":-3.625},null,null,null,null,null,null,null,null,null,null,null,null,null,null,null,null,null,null,null,null,null,null,null,null,null,null,null,null,"Single Strength (2.5 mm)","S",2.3140000000000001]
[{"$f":"IF(OR(ModelNo=\"0179\",ModelNo=\"0979\",ModelNo=\"9079\",ModelNo=\"8079\"),10,\"\")","v":""},"0179","Screen Height",{"$f":"Frame_Height-4","v":-4},null,null,null,null,null,null,null,null,null,null,null,null,null,null,null,null,null,null,null,null,null,null,null,null,null,null,null,null,"Double Strength (3 mm)","D",3.2]
[{"$f":"IF(OR(ModelNo=\"0179\",ModelNo=\"0979\",ModelNo=\"9079\",ModelNo=\"8079\"),11,\"\")","v":""},"0179","Egress Opening Width (Standard Hinge)",{"$f":"TRUNC(((Frame_Width/3)-10.916)*16+0.5)/16","v":-10.875},null,null,null,null,null,null,null,null,null,null,null,null,null,null,null,null,null,null,null,null,null,null,null,null,null,null,null,null,"Triple Strength (5 mm)","T",4.8159999999999998]
[{"$f":"IF(OR(ModelNo=\"0179\",ModelNo=\"0979\",ModelNo=\"9079\",ModelNo=\"8079\"),12,\"\")","v":""},"0179","Egress Opening Height (Standard Hinge)",{"$f":"Frame_Height-4.375","v":-4.375},null,null,null,null,null,null,null,null,null,null,null,null,null,null,null,null,null,null,null,null,null,null,null,null,null,null,null,null,"Triple IG Single Strength","STG",3.4710000000000001]
[{"$f":"IF(OR(ModelNo=\"0179\",ModelNo=\"0979\",ModelNo=\"9079\",ModelNo=\"8079\"),13,\"\")","v":""},"0179","Egress Opening Area w/Standard Hinge (sq.ft.)",{"$f":"(D104*D105)/144","v":0.33040364583333331},null,null,null,null,null,null,null,null,null,null,null,null,null,null,null,null,null,null,null,null,null,null,null,null,null,null,null,null,"Triple IG Double Strength","DTG",4.8]
[{"$f":"IF(OR(ModelNo=\"0179\",ModelNo=\"0979\",ModelNo=\"9079\",ModelNo=\"8079\"),14,\"\")","v":""},"0179","Egress Opening Width (Egress Hinge)",{"$f":"IF(D94<22.375,\"N/A\",TRUNC(((Frame_Width/3)-6.4785)*16+0.5)/16)","v":"N/A"},null,null,null,null,null,null,null,null,null,null,null,null,null,null,null,null,null,null,null,null,null,null,null,null,null,null,null,null,"Laminated","L",5.3659999999999997]
[{"$f":"IF(OR(ModelNo=\"0179\",ModelNo=\"0979\",ModelNo=\"9079\",ModelNo=\"8079\"),15,\"\")","v":""},"0179","Egress Opening Height (Egress Hinge)",{"$f":"IF(D94<22.375,\"N/A\",Frame_Height-4.375)","v":"N/A"},null,null,null,null,null,null,null,null,null,null,null,null,null,null,null,null,null,null,null,null,null,null,null,null,null,null,null,null,"HP package","H",4.8159999999999998]
[{"$f":"IF(OR(ModelNo=\"0179\",ModelNo=\"0979\",ModelNo=\"9079\",ModelNo=\"8079\"),16,\"\")","v":""},"0179","Egress Opening Area w/Egress Hinge (sq.ft.)",{"$f":"IF(D94<22.375,\"N/A\",(D107*D108)/144)","v":"N/A"},null,null,null,null,null,null,null,null,null,null,null,null,null,null,null,null,null,null,null,null,null,null,null,null,null,null,null,null,"Impact Laminated","IL",5.3659999999999997]
[{"$f":"IF(OR(ModelNo=\"0179\",ModelNo=\"0979\",ModelNo=\"9079\",ModelNo=\"8079\"),17,\"\")","v":""},"0179","Mull Location From Edge of Frame",{"$f":"(TRUNC((Frame_Width/3)*16+0.5)/16)+0.125","v":0.125}]
[{"$f":"IF(OR(ModelNo=\"S174\",ModelNo=\"0974\",ModelNo=\"9074\",ModelNo=\"8074\"),1,\"\")","v":""},"S174","Operating Sash Width",{"$f":"(Frame_Width/4)-1.25","v":-1.25}]
[{"$f":"IF(OR(ModelNo=\"S174\",ModelNo=\"0974\",ModelNo=\"9074\",ModelNo=\"8074\"),2,\"\")","v":""},"S174","Operating Sash Height",{"$f":"Frame_Height-1.625","v":-1.625}]
[{"$f":"IF(OR(ModelNo=\"S174\",ModelNo=\"0974\",ModelNo=\"9074\",ModelNo=\"8074\"),3,\"\")","v":""},"S174","Fixed Sash Width",{"$f":"(Frame_Width/4)-1.25","v":-1.25}]
[{"$f":"IF(OR(ModelNo=\"S174\",ModelNo=\"0974\",ModelNo=\"9074\",ModelNo=\"8074\"),4,\"\")","v":""},"S174","Fixed Sash Height",{"$f":"Frame_Height-1.625","v":-1.625}]
[{"$f":"IF(OR(ModelNo=\"S174\",ModelNo=\"0974\",ModelNo=\"9074\",ModelNo=\"8074\"),5,\"\")","v":""},"S174","Operating Sash Glass Width",{"$f":"(Frame_Width/4)-4.25","v":-4.25}]
[{"$f":"IF(OR(ModelNo=\"S174\",ModelNo=\"0974\",ModelNo=\"9074\",ModelNo=\"8074\"),6,\"\")","v":""},"S174","Operating Sash Glass Height",{"$f":"Frame_Height-4.625","v":-4.625}]
[{"$f":"IF(OR(ModelNo=\"S174\",ModelNo=\"0974\",ModelNo=\"9074\",ModelNo=\"8074\"),7,\"\")","v":""},"S174","Fixed Sash Glass Width",{"$f":"(Frame_Width/4)-4.25","v":-4.25}]
[{"$f":"IF(OR(ModelNo=\"S174\",ModelNo=\"0974\",ModelNo=\"9074\",ModelNo=\"8074\"),8,\"\")","v":""},"S174","Fixed Sash Glass Height",{"$f":"Frame_Height-4.625","v":-4.625}]
[{"$f":"IF(OR(ModelNo=\"S174\",ModelNo=\"0974\",ModelNo=\"9074\",ModelNo=\"8074\"),9,\"\")","v":""},"S174","Screen Width",{"$f":"(Frame_Width/4)-3.625","v":-3.625}]
[{"$f":"IF(OR(ModelNo=\"S174\",ModelNo=\"0974\",ModelNo=\"9074\",ModelNo=\"8074\"),10,\"\")","v":""},"S174","Screen Height",{"$f":"Frame_Height-4","v":-4}]
[{"$f":"IF(OR(ModelNo=\"S174\",ModelNo=\"0974\",ModelNo=\"9074\",ModelNo=\"8074\"),11,\"\")","v":""},"S174","Egress Opening Width (Standard Hinge)",{"$f":"(Frame_Width/4)-10.875","v":-10.875}]
[{"$f":"IF(OR(ModelNo=\"S174\",ModelNo=\"0974\",ModelNo=\"9074\",ModelNo=\"8074\"),12,\"\")","v":""},"S174","Egress Opening Height (Standard Hinge)",{"$f":"Frame_Height-4.375","v":-4.375}]
[{"$f":"IF(OR(ModelNo=\"S174\",ModelNo=\"0974\",ModelNo=\"9074\",ModelNo=\"8074\"),13,\"\")","v":""},"S174","Egress Opening Area w/Standard Hinge (sq.ft.)",{"$f":"(D121*D122)/144","v":0.33040364583333331}]
[{"$f":"IF(OR(ModelNo=\"S174\",ModelNo=\"0974\",ModelNo=\"9074\",ModelNo=\"8074\"),14,\"\")","v":""},"S174","Egress Opening Width (Egress Hinge)",{"$f":"IF(D111<22.375,\"N/A\",(Frame_Width/4)-6.4375)","v":"N/A"}]
[{"$f":"IF(OR(ModelNo=\"S174\",ModelNo=\"0974\",ModelNo=\"9074\",ModelNo=\"8074\"),15,\"\")","v":""},"S174","Egress Opening Height (Egress Hinge)",{"$f":"IF(D111<22.375,\"N/A\",Frame_Height-4.375)","v":"N/A"}]
[{"$f":"IF(OR(ModelNo=\"S174\",ModelNo=\"0974\",ModelNo=\"9074\",ModelNo=\"8074\"),16,\"\")","v":""},"S174","Egress Opening Area w/Egress Hinge (sq.ft.)",{"$f":"IF(D111<22.375,\"N/A\",(D124*D125)/144)","v":"N/A"}]
[{"$f":"IF(OR(ModelNo=\"S174\",ModelNo=\"0974\",ModelNo=\"9074\",ModelNo=\"8074\"),17,\"\")","v":""},"S174","Mull Location From Edge of Frame",{"$f":"(Frame_Width/4)+0.125","v":0.125}]
[{"$f":"IF(OR(ModelNo=\"S174\",ModelNo=\"0974\",ModelNo=\"9074\",ModelNo=\"8074\"),18,\"\")","v":""},"S174","Distance Between Mulls",{"$f":"(Frame_Width/4)-0.125","v":-0.125}]
[{"$f":"IF(OR(ModelNo=\"S175\",ModelNo=\"0975\",ModelNo=\"9075\",ModelNo=\"8075\"),1,\"\")","v":""},"S175","Operating Sash Width",{"$f":"TRUNC(((Frame_Width/5)-1.225)*16+0.5)/16","v":-1.1875}]
[{"$f":"IF(OR(ModelNo=\"S175\",ModelNo=\"0975\",ModelNo=\"9075\",ModelNo=\"8075\"),2,\"\")","v":""},"S175","Operating Sash Height",{"$f":"Frame_Height-1.625","v":-1.625}]
[{"$f":"IF(OR(ModelNo=\"S175\",ModelNo=\"0975\",ModelNo=\"9075\",ModelNo=\"8075\"),3,\"\")","v":""},"S175","Fixed Sash Width",{"$f":"TRUNC(((Frame_Width/5)-1.225)*16+0.5)/16","v":-1.1875}]
[{"$f":"IF(OR(ModelNo=\"S175\",ModelNo=\"0975\",ModelNo=\"9075\",ModelNo=\"8075\"),4,\"\")","v":""},"S175","Fixed Sash Height",{"$f":"Frame_Height-1.625","v":-1.625}]
[{"$f":"IF(OR(ModelNo=\"S175\",ModelNo=\"0975\",ModelNo=\"9075\",ModelNo=\"8075\"),5,\"\")","v":""},"S175","Operating Sash Glass Width",{"$f":"TRUNC(((Frame_Width/5)-4.225)*16+0.5)/16","v":-4.1875}]
[{"$f":"IF(OR(ModelNo=\"S175\",ModelNo=\"0975\",ModelNo=\"9075\",ModelNo=\"8075\"),6,\"\")","v":""},"S175","Operating Sash Glass Height",{"$f":"Frame_Height-4.625","v":-4.625}]
[{"$f":"IF(OR(ModelNo=\"S175\",ModelNo=\"0975\",ModelNo=\"9075\",ModelNo=\"8075\"),7,\"\")","v":""},"S175","Fixed Sash Glass Width",{"$f":"TRUNC(((Frame_Width/5)-4.225)*16+0.5)/16","v":-4.1875}]
[{"$f":"IF(OR(ModelNo=\"S175\",ModelNo=\"0975\",ModelNo=\"9075\",ModelNo=\"8075\"),8,\"\")","v":""},"S175","Fixed Sash Glass Height",{"$f":"Frame_Height-4.625","v":-4.625}]
[{"$f":"IF(OR(ModelNo=\"S175\",ModelNo=\"0975\",ModelNo=\"9075\",ModelNo=\"8075\"),9,\"\")","v":""},"S175","Screen Width",{"$f":"TRUNC(((Frame_Width/5)-3.7625)*16+0.5)/16","v":-3.6875}]
[{"$f":"IF(OR(ModelNo=\"S175\",ModelNo=\"0975\",ModelNo=\"9075\",ModelNo=\"8075\"),10,\"\")","v":""},"S175","Screen Height",{"$f":"Frame_Height-4","v":-4}]
[{"$f":"IF(OR(ModelNo=\"S175\",ModelNo=\"0975\",ModelNo=\"9075\",ModelNo=\"8075\"),11,\"\")","v":""},"S175","Egress Opening Width (Standard Hinge)",{"$f":"TRUNC(((Frame_Width/5)-10.875)*16+0.5)/16","v":-10.8125}]
[{"$f":"IF(OR(ModelNo=\"S175\",ModelNo=\"0975\",ModelNo=\"9075\",ModelNo=\"8075\"),12,\"\")","v":""},"S175","Egress Opening Height (Standard Hinge)",{"$f":"Frame_Height-4.375","v":-4.375}]
[{"$f":"IF(OR(ModelNo=\"S175\",ModelNo=\"0975\",ModelNo=\"9075\",ModelNo=\"8075\"),13,\"\")","v":""},"S175","Egress Opening Area w/Standard Hinge (sq.ft.)",{"$f":"(D139*D140)/144","v":0.32850477430555558}]
[{"$f":"IF(OR(ModelNo=\"S175\",ModelNo=\"0975\",ModelNo=\"9075\",ModelNo=\"8075\"),14,\"\")","v":""},"S175","Egress Opening Width (Egress Hinge)",{"$f":"IF(D129<22.375,\"N/A\",TRUNC(((Frame_Width/5)-6.4375)*16+0.5)/16)","v":"N/A"}]
[{"$f":"IF(OR(ModelNo=\"S175\",ModelNo=\"0975\",ModelNo=\"9075\",ModelNo=\"8075\"),15,\"\")","v":""},"S175","Egress Opening Height (Egress Hinge)",{"$f":"IF(D129<22.375,\"N/A\",Frame_Height-4.375)","v":"N/A"}]
[{"$f":"IF(OR(ModelNo=\"S175\",ModelNo=\"0975\",ModelNo=\"9075\",ModelNo=\"8075\"),16,\"\")","v":""},"S175","Egress Opening Area w/Egress Hinge (sq.ft.)",{"$f":"IF(D129<22.375,\"N/A\",(D142*D143)/144)","v":"N/A"}]
[{"$f":"IF(OR(ModelNo=\"S175\",ModelNo=\"0975\",ModelNo=\"9075\",ModelNo=\"8075\"),17,\"\")","v":""},"S175","Mull Location From Edge of Frame",{"$f":"(TRUNC((Frame_Width/5)*16+0.5)/16)+0.125","v":0.125}]
[{"$f":"IF(OR(ModelNo=\"S175\",ModelNo=\"0975\",ModelNo=\"9075\",ModelNo=\"8075\"),18,\"\")","v":""},"S175","Distance Between Mulls",{"$f":"(TRUNC((Frame_Width/5)*16+0.5)/16)-0.125","v":-0.125}]
[{"$f":"IF(OR(ModelNo=\"1105\",ModelNo=\"1106\",ModelNo=\"1108\",ModelNo=\"1176\"),1,\"\")","v":""},"1100","Sash Width",{"$f":"(Frame_Width/2)+1.0625","v":1.0625}]
[{"$f":"IF(OR(ModelNo=\"1105\",ModelNo=\"1106\",ModelNo=\"1108\",ModelNo=\"1176\"),2,\"\")","v":""},"1100","Sash Height",{"$f":"Frame_Height-2.1875","v":-2.1875}]
[{"$f":"IF(OR(ModelNo=\"1105\",ModelNo=\"1106\",ModelNo=\"1108\",ModelNo=\"1176\"),3,\"\")","v":""},"1100","Roller Track Length",{"$f":"Frame_Width-1.25","v":-1.25}]
[{"$f":"IF(OR(ModelNo=\"1105\",ModelNo=\"1106\",ModelNo=\"1108\",ModelNo=\"1176\"),4,\"\")","v":""},"1100","Glass Width",{"$f":"(Frame_Width/2)-2.8125","v":-2.8125}]
[{"$f":"IF(OR(ModelNo=\"1105\",ModelNo=\"1106\",ModelNo=\"1108\",ModelNo=\"1176\"),5,\"\")","v":""},"1100","Glass Height",{"$f":"Frame_Height-6.125","v":-6.125}]
[{"$f":"IF(OR(ModelNo=\"1105\",ModelNo=\"1106\",ModelNo=\"1108\",ModelNo=\"1176\"),6,\"\")","v":""},"1100","Screen Width",{"$f":"(Frame_Width/2)+0.0625","v":6.25E-2}]
[{"$f":"IF(OR(ModelNo=\"1105\",ModelNo=\"1106\",ModelNo=\"1108\",ModelNo=\"1176\"),7,\"\")","v":""},"1100","Screen Height",{"$f":"Frame_Height-1.625","v":-1.625}]
[{"$f":"IF(OR(ModelNo=\"1105\",ModelNo=\"1106\",ModelNo=\"1108\",ModelNo=\"1176\"),8,\"\")","v":""},"1100","Egress Opening Width",{"$f":"(Frame_Width/2)-5.59375","v":-5.59375}]
[{"$f":"IF(OR(ModelNo=\"1105\",ModelNo=\"1106\",ModelNo=\"1108\",ModelNo=\"1176\"),9,\"\")","v":""},"1100","Egress Opening Height",{"$f":"Frame_Height-3.125","v":-3.125}]
[{"$f":"IF(OR(ModelNo=\"1105\",ModelNo=\"1106\",ModelNo=\"1108\",ModelNo=\"1176\"),10,\"\")","v":""},"1100","Egress Opening Area (sq.ft.)",{"$f":"(D154*D155)/144","v":0.12139214409722222}]
[{"$f":"IF(ModelNo=B157,1,\"\")","v":""},"1109","Sash Width",{"$f":"TRUNC(((Frame_Width/3)+1.5625)*16+0.5)/16","v":1.5625}]
[{"$f":"IF(ModelNo=B158,2,\"\")","v":""},"1109","Sash Height",{"$f":"Frame_Height-2.1875","v":-2.1875}]
[{"$f":"IF(ModelNo=B159,3,\"\")","v":""},"1109","Roller Track Length",{"$f":"TRUNC(((((Frame_Width+0.625)/3)*2)-0.75)*16+0.5)/16","v":-0.25}]
[{"$f":"IF(ModelNo=B160,4,\"\")","v":""},"1109","Glass Width",{"$f":"TRUNC(((Frame_Width/3)-2.3125)*16+0.5)/16","v":-2.25}]
[{"$f":"IF(ModelNo=B161,5,\"\")","v":""},"1109","Glass Height",{"$f":"Frame_Height-6.125","v":-6.125}]
[{"$f":"IF(ModelNo=B162,6,\"\")","v":""},"1109","Screen Width",{"$f":"TRUNC(((Frame_Width/3)-0.0625)*16+0.5)/16","v":0}]
[{"$f":"IF(ModelNo=B163,7,\"\")","v":""},"1109","Screen Height",{"$f":"Frame_Height-1.625","v":-1.625}]
[{"$f":"IF(ModelNo=B164,8,\"\")","v":""},"1109","Egress Opening Width",{"$f":"(Frame_Width/3)-5.25","v":-5.25}]
[{"$f":"IF(ModelNo=B165,9,\"\")","v":""},"1109","Egress Opening Height",{"$f":"Frame_Height-3.125","v":-3.125}]
[{"$f":"IF(ModelNo=B166,10,\"\")","v":""},"1109","Egress Opening Area (sq.ft.)",{"$f":"(D164*D165)/144","v":0.11393229166666667}]
[{"$f":"IF(ModelNo=B167,11,\"\")","v":""},"1109","Center of Meeting Rail (Lock side)",{"$f":"(TRUNC((Frame_Width/3)*16+0.5)/16)+0.375","v":0.375}]
[{"$f":"IF(ModelNo=B168,12,\"\")","v":""},"1109","Center of Meeting Rail (Mullion side)",{"$f":"(TRUNC((Frame_Width/3)*16+0.5)/16)-0.5","v":-0.5}]
[{"$f":"IF(OR(ModelNo=\"11C5\",ModelNo=\"11C6\",ModelNo=\"11C8\"),1,\"\")","v":""},"11C/i","Sash Width",{"$f":"(Frame_Width/2)+0.6875","v":0.6875}]
[{"$f":"IF(OR(ModelNo=\"11C5\",ModelNo=\"11C6\",ModelNo=\"11C8\"),2,\"\")","v":""},"11C/i","Sash Height",{"$f":"Frame_Height-3.0625","v":-3.0625}]
[{"$f":"IF(OR(ModelNo=\"11C5\",ModelNo=\"11C6\",ModelNo=\"11C8\"),3,\"\")","v":""},"11C/i","Roller Track Length",{"$f":"Frame_Width-2.125","v":-2.125}]
[{"$f":"IF(OR(ModelNo=\"11C5\",ModelNo=\"11C6\",ModelNo=\"11C8\"),4,\"\")","v":""},"11C/i","Glass Width",{"$f":"(Frame_Width/2)-3.1875","v":-3.1875}]
[{"$f":"IF(OR(ModelNo=\"11C5\",ModelNo=\"11C6\",ModelNo=\"11C8\"),5,\"\")","v":""},"11C/i","Glass Height",{"$f":"Frame_Height-6.9375","v":-6.9375}]
[{"$f":"IF(OR(ModelNo=\"11C5\",ModelNo=\"11C6\",ModelNo=\"11C8\"),6,\"\")","v":""},"11C/i","Screen Width",{"$f":"Frame_Width/2","v":0}]
[{"$f":"IF(OR(ModelNo=\"11C5\",ModelNo=\"11C6\",ModelNo=\"11C8\"),7,\"\")","v":""},"11C/i","Screen Height",{"$f":"Frame_Height-2.125","v":-2.125}]
[{"$f":"IF(OR(ModelNo=\"11C5\",ModelNo=\"11C6\",ModelNo=\"11C8\"),8,\"\")","v":""},"11C/i","Egress Opening Width",{"$f":"(Frame_Width/2)-6","v":-6}]
[{"$f":"IF(OR(ModelNo=\"11C5\",ModelNo=\"11C6\",ModelNo=\"11C8\"),9,\"\")","v":""},"11C/i","Egress Opening Height",{"$f":"Frame_Height-4","v":-4}]
[{"$f":"IF(OR(ModelNo=\"11C5\",ModelNo=\"11C6\",ModelNo=\"11C8\"),10,\"\")","v":""},"11C/i","Egress Opening Area (sq.ft.)",{"$f":"(D176*D177)/144","v":0.16666666666666666}]
[{"$f":"IF(ModelNo=B179,1,\"\")","v":""},"11C9","Sash Width",{"$f":"TRUNC(((Frame_Width/3)+1.25)*16+0.5)/16","v":1.25}]
[{"$f":"IF(ModelNo=B180,2,\"\")","v":""},"11C9","Sash Height",{"$f":"Frame_Height-3","v":-3}]
[{"$f":"IF(ModelNo=B181,3,\"\")","v":""},"11C9","Roller Track Length",{"$f":"TRUNC(((((Frame_Width+0.625)/3)*2)-0.75)*16+0.5)/16","v":-0.25}]
[{"$f":"IF(ModelNo=B182,4,\"\")","v":""},"11C9","Glass Width",{"$f":"TRUNC(((Frame_Width/3)-2.625)*16+0.5)/16","v":-2.5625}]
[{"$f":"IF(ModelNo=B183,5,\"\")","v":""},"11C9","Glass Height",{"$f":"Frame_Height-6.9375","v":-6.9375}]
[{"$f":"IF(ModelNo=B184,6,\"\")","v":""},"11C9","Screen Width",{"$f":"TRUNC(((Frame_Width/3)-0.1875)*16+0.5)/16","v":-0.125}]
[{"$f":"IF(ModelNo=B185,7,\"\")","v":""},"11C9","Screen Height",{"$f":"Frame_Height-2.125","v":-2.125}]
[{"$f":"IF(ModelNo=B186,8,\"\")","v":""},"11C9","Egress Opening Width",{"$f":"(Frame_Width/3)-5.75","v":-5.75}]
[{"$f":"IF(ModelNo=B187,9,\"\")","v":""},"11C9","Egress Opening Height",{"$f":"Frame_Height-4","v":-4}]
[{"$f":"IF(ModelNo=B188,10,\"\")","v":""},"11C9","Egress Opening Area (sq.ft.)",{"$f":"(D186*D187)/144","v":0.15972222222222221}]
[{"$f":"IF(ModelNo=B189,11,\"\")","v":""},"11C9","Center of Meeting Rail (Lock side)",{"$f":"(TRUNC((Frame_Width/3)*16+0.5)/16)+0.375","v":0.375}]
[{"$f":"IF(ModelNo=B190,12,\"\")","v":""},"11C9","Center of Meeting Rail (Mullion side)",{"$f":"(TRUNC((Frame_Width/3)*16+0.5)/16)-0.5","v":-0.5}]
[{"$f":"IF(OR(ModelNo=\"5102\",ModelNo=\"5105\",ModelNo=\"5106\",ModelNo=\"5108\",,ModelNo=\"5175\"),1,\"\")","v":""},"5102","Sash Width",{"$f":"(Frame_Width/2)+1.0625","v":1.0625}]
[{"$f":"IF(OR(ModelNo=\"5102\",ModelNo=\"5105\",ModelNo=\"5106\",ModelNo=\"5108\",,ModelNo=\"5175\"),2,\"\")","v":""},"5102","Sash Height",{"$f":"Frame_Height-2.1875","v":-2.1875}]
[{"$f":"IF(OR(ModelNo=\"5102\",ModelNo=\"5105\",ModelNo=\"5106\",ModelNo=\"5108\",,ModelNo=\"5175\"),3,\"\")","v":""},"5102","Roller Track Length",{"$f":"Frame_Width-1.25","v":-1.25}]
[{"$f":"IF(OR(ModelNo=\"5102\",ModelNo=\"5105\",ModelNo=\"5106\",ModelNo=\"5108\",,ModelNo=\"5175\"),4,\"\")","v":""},"5102","Glass Width",{"$f":"(Frame_Width/2)-2.8125","v":-2.8125}]
[{"$f":"IF(OR(ModelNo=\"5102\",ModelNo=\"5105\",ModelNo=\"5106\",ModelNo=\"5108\",,ModelNo=\"5175\"),5,\"\")","v":""},"5102","Glass Height",{"$f":"Frame_Height-6.125","v":-6.125}]
[{"$f":"IF(OR(ModelNo=\"5102\",ModelNo=\"5105\",ModelNo=\"5106\",ModelNo=\"5108\",,ModelNo=\"5175\"),6,\"\")","v":""},"5102","Screen Width",{"$f":"(Frame_Width/2)+0.0625","v":6.25E-2}]
[{"$f":"IF(OR(ModelNo=\"5102\",ModelNo=\"5105\",ModelNo=\"5106\",ModelNo=\"5108\",,ModelNo=\"5175\"),7,\"\")","v":""},"5102","Screen Height",{"$f":"Frame_Height-1.625","v":-1.625}]
[{"$f":"IF(OR(ModelNo=\"5102\",ModelNo=\"5105\",ModelNo=\"5106\",ModelNo=\"5108\",,ModelNo=\"5175\"),8,\"\")","v":""},"5102","Egress Opening Width",{"$f":"(Frame_Width/2)-5.59375","v":-5.59375}]
[{"$f":"IF(OR(ModelNo=\"5102\",ModelNo=\"5105\",ModelNo=\"5106\",ModelNo=\"5108\",,ModelNo=\"5175\"),9,\"\")","v":""},"5102","Egress Opening Height",{"$f":"Frame_Height-3.125","v":-3.125}]
[{"$f":"IF(OR(ModelNo=\"5102\",ModelNo=\"5105\",ModelNo=\"5106\",ModelNo=\"5108\",,ModelNo=\"5175\"),10,\"\")","v":""},"5102","Egress Opening Area (sq.ft.)",{"$f":"(D198*D199)/144","v":0.12139214409722222}]
[{"$f":"IF(OR(ModelNo=\"5103\",ModelNo=\"5109\"),1,\"\")","v":""},"5103","Sash Width",{"$f":"TRUNC(((Frame_Width/3)+1.5625)*16+0.5)/16","v":1.5625}]
[{"$f":"IF(OR(ModelNo=\"5103\",ModelNo=\"5109\"),2,\"\")","v":""},"5103","Sash Height",{"$f":"Frame_Height-2.1875","v":-2.1875}]
[{"$f":"IF(OR(ModelNo=\"5103\",ModelNo=\"5109\"),3,\"\")","v":""},"5103","Roller Track Length",{"$f":"TRUNC(((((Frame_Width+0.625)/3)*2)-0.75)*16+0.5)/16","v":-0.25}]
[{"$f":"IF(OR(ModelNo=\"5103\",ModelNo=\"5109\"),4,\"\")","v":""},"5103","Glass Width",{"$f":"TRUNC(((Frame_Width/3)-2.3125)*16+0.5)/16","v":-2.25}]
[{"$f":"IF(OR(ModelNo=\"5103\",ModelNo=\"5109\"),5,\"\")","v":""},"5103","Glass Height",{"$f":"Frame_Height-6.125","v":-6.125}]
[{"$f":"IF(OR(ModelNo=\"5103\",ModelNo=\"5109\"),6,\"\")","v":""},"5103","Screen Width",{"$f":"TRUNC(((Frame_Width/3)+0.1875)*16+0.5)/16","v":0.1875}]
[{"$f":"IF(OR(ModelNo=\"5103\",ModelNo=\"5109\"),7,\"\")","v":""},"5103","Screen Height",{"$f":"Frame_Height-1.625","v":-1.625}]
[{"$f":"IF(OR(ModelNo=\"5103\",ModelNo=\"5109\"),8,\"\")","v":""},"5103","Egress Opening Width",{"$f":"(Frame_Width/3)-5.25","v":-5.25}]
[{"$f":"IF(OR(ModelNo=\"5103\",ModelNo=\"5109\"),9,\"\")","v":""},"5103","Egress Opening Height",{"$f":"Frame_Height-3.125","v":-3.125}]
[{"$f":"IF(OR(ModelNo=\"5103\",ModelNo=\"5109\"),10,\"\")","v":""},"5103","Egress Opening Area (sq.ft.)",{"$f":"(D208*D209)/144","v":0.11393229166666667}]
[{"$f":"IF(OR(ModelNo=\"5103\",ModelNo=\"5109\"),11,\"\")","v":""},"5103","Center of Meeting Rail (Lock side)",{"$f":"(TRUNC((Frame_Width/3)*16+0.5)/16)+0.375","v":0.375}]
[{"$f":"IF(OR(ModelNo=\"5103\",ModelNo=\"5109\"),12,\"\")","v":""},"5103","Center of Meeting Rail (Mullion side)",{"$f":"(TRUNC((Frame_Width/3)*16+0.5)/16)-0.5","v":-0.5}]
[{"$f":"IF(OR(ModelNo=\"S140\",ModelNo=\"S140 (HP)\",ModelNo=\"S144\",ModelNo=\"S144 (HP)\",ModelNo=\"S146\",ModelNo=\"S146 (HP)\"),1,\"\")","v":""},"S140","Frame Radius",{"$f":"IF(ModelNo=\"S146\",((Frame_Height-LEG)/2)+(((Frame_Width*2)^2)/(8*(Frame_Height-LEG))),((Frame_Height-LEG)/2)+((Frame_Width^2)/(8*(Frame_Height-LEG))))","v":{"$error":"#DIV/0!"}}]
[{"$f":"IF(OR(ModelNo=\"S140\",ModelNo=\"S140 (HP)\",ModelNo=\"S144\",ModelNo=\"S144 (HP)\",ModelNo=\"S146\",ModelNo=\"S146 (HP)\"),2,\"\")","v":""},"S140","Bottom Sash Width",{"$f":"BSW_S140","v":0}]
[{"$f":"IF(OR(ModelNo=\"S140\",ModelNo=\"S140 (HP)\",ModelNo=\"S144\",ModelNo=\"S144 (HP)\",ModelNo=\"S146\",ModelNo=\"S146 (HP)\"),3,\"\")","v":""},"S140","Bottom Sash Height",{"$f":"BSH_S140","v":0}]
[{"$f":"IF(OR(ModelNo=\"S140\",ModelNo=\"S140 (HP)\",ModelNo=\"S144\",ModelNo=\"S144 (HP)\",ModelNo=\"S146\",ModelNo=\"S146 (HP)\"),4,\"\")","v":""},"S140","Bottom Glass Width",{"$f":"BGW_S140","v":0}]
[{"$f":"IF(OR(ModelNo=\"S140\",ModelNo=\"S140 (HP)\",ModelNo=\"S144\",ModelNo=\"S144 (HP)\",ModelNo=\"S146\",ModelNo=\"S146 (HP)\"),5,\"\")","v":""},"S140","Bottom Glass Height",{"$f":"BGH_S140","v":0}]
[{"$f":"IF(OR(ModelNo=\"S140\",ModelNo=\"S140 (HP)\",ModelNo=\"S144\",ModelNo=\"S144 (HP)\",ModelNo=\"S146\",ModelNo=\"S146 (HP)\"),6,\"\")","v":""},"S140","Top Glass Radius",{"$f":"S140_R","v":{"$error":"#DIV/0!"}}]
[{"$f":"IF(OR(ModelNo=\"S140\",ModelNo=\"S140 (HP)\",ModelNo=\"S144\",ModelNo=\"S144 (HP)\",ModelNo=\"S146\",ModelNo=\"S146 (HP)\"),7,\"\")","v":""},"S140","Top Glass Width",{"$f":"TGW_S140","v":0}]
[{"$f":"IF(OR(ModelNo=\"S140\",ModelNo=\"S140 (HP)\",ModelNo=\"S144\",ModelNo=\"S144 (HP)\",ModelNo=\"S146\",ModelNo=\"S146 (HP)\"),8,\"\")","v":""},"S140","Top Glass Height",{"$f":"TGH_S140","v":-0.51370000000000005}]
[{"$f":"IF(OR(ModelNo=\"S140\",ModelNo=\"S140 (HP)\",ModelNo=\"S144\",ModelNo=\"S144 (HP)\",ModelNo=\"S146\",ModelNo=\"S146 (HP)\"),9,\"\")","v":""},"S140","Top Glass Leg Height",{"$f":"GLASSLEG_S140","v":{"$error":"#DIV/0!"}}]
[{"$f":"IF(OR(ModelNo=\"S140\",ModelNo=\"S140 (HP)\",ModelNo=\"S144\",ModelNo=\"S144 (HP)\",ModelNo=\"S146\",ModelNo=\"S146 (HP)\"),10,\"\")","v":""},"S140","Astragal Length",{"$f":"IF(EXTSELECT=8,TRUNC((Frame_Width-2.875)*16+0.5)/16,IF(EXTSELECT=7,TRUNC((Frame_Width-2.95)*16+0.5)/16,IF(EXTSELECT=6,TRUNC((Frame_Width-2.868)*16+0.5)/16,IF(OR(EXTSELECT=4,EXTSELECT=5),TRUNC((Frame_Width-1.218)*16+0.5)/16,TRUNC((Frame_Width-4.125)*16+0.5)/16))))","v":-4.0625}]
[{"$f":"IF(OR(ModelNo=\"S140\",ModelNo=\"S140 (HP)\",ModelNo=\"S144\",ModelNo=\"S144 (HP)\",ModelNo=\"S146\",ModelNo=\"S146 (HP)\"),11,\"\")","v":""},"S140","Screen Width",{"$f":"IF(OR(EXTSELECT=7,EXTSELECT=8),Frame_Width-3.3125,IF(OR(EXTSELECT=4,EXTSELECT=5),Frame_Width-1.75,IF(EXTSELECT=6,Frame_Width-3.6875,Frame_Width-4.5)))","v":-4.5}]
[{"$f":"IF(OR(ModelNo=\"S140\",ModelNo=\"S140 (HP)\",ModelNo=\"S144\",ModelNo=\"S144 (HP)\",ModelNo=\"S146\",ModelNo=\"S146 (HP)\"),12,\"\")","v":""},"S140","Screen Height",{"$f":"IF(OR(EXTSELECT=2,EXTSELECT=3),CDIM_S140-1.3125,IF(EXTSELECT=6,CDIM_S140-0.75,IF(EXTSELECT=7,CDIM_S140-1.46875,IF(EXTSELECT=8,CDIM_S140-1.75,CDIM_S140-1.1875))))","v":-1.1875}]
[{"$f":"IF(OR(ModelNo=\"S140\",ModelNo=\"S140 (HP)\",ModelNo=\"S144\",ModelNo=\"S144 (HP)\",ModelNo=\"S146\",ModelNo=\"S146 (HP)\"),13,\"\")","v":""},"S140","Bottom Sash Weight",{"$f":"IF(ISERROR(BTM_WGT&\" \"&\"lb\"),\"N/A\",BTM_WGT&\" \"&\"lb\")","v":"0 lb"}]
[{"$f":"IF(OR(ModelNo=\"S140\",ModelNo=\"S140 (HP)\",ModelNo=\"S144\",ModelNo=\"S144 (HP)\",ModelNo=\"S146\",ModelNo=\"S146 (HP)\"),14,\"\")","v":""},"S140","Balance Size",{"$f":"IF(BT_DRIVER=1,IF(BOTT_BT=0,\"N/A\",BOTT_BT),IF(ISERROR((VLOOKUP(BTM_WGT,CFB,2,FALSE))),\"N/A\",(VLOOKUP(BTM_WGT,CFB,2,FALSE))))","v":"N/A"}]
[{"$f":"IF(OR(ModelNo=\"S140\",ModelNo=\"S140 (HP)\",ModelNo=\"S144\",ModelNo=\"S144 (HP)\",ModelNo=\"S146\",ModelNo=\"S146 (HP)\"),15,\"\")","v":""},"S140","Egress Opening Width",{"$f":"IF(ISERROR(EW),\"N/A\",EW)","v":0}]
[{"$f":"IF(OR(ModelNo=\"S140\",ModelNo=\"S140 (HP)\",ModelNo=\"S144\",ModelNo=\"S144 (HP)\",ModelNo=\"S146\",ModelNo=\"S146 (HP)\"),16,\"\")","v":""},"S140","Egress Opening Height",{"$f":"IF(ISERROR(EH),\"N/A\",EH)","v":0}]
[{"$f":"IF(OR(ModelNo=\"S140\",ModelNo=\"S140 (HP)\",ModelNo=\"S144\",ModelNo=\"S144 (HP)\",ModelNo=\"S146\",ModelNo=\"S146 (HP)\"),17,\"\")","v":""},"S140","Egress Opening Area (sq.ft.)",{"$f":"(D227*D228)/144","v":0}]
[{"$f":"IF(OR(ModelNo=\"6402\",ModelNo=\"6405\",ModelNo=\"6406\",ModelNo=\"6408\",ModelNo=\"6475\",ModelNo=\"8402\",ModelNo=\"8405\",ModelNo=\"8406\",ModelNo=\"8408\",ModelNo=\"8475\"),1,\"\")","v":""},"6402","Sash Width",{"$f":"IF(TYPE=2,TRUNC(((Frame_Width/2)+1)*16+0.5)/16,TRUNC(((Frame_Width/2)+0.1875)*16+0.5)/16)","v":0.1875}]
[{"$f":"IF(OR(ModelNo=\"6402\",ModelNo=\"6405\",ModelNo=\"6406\",ModelNo=\"6408\",ModelNo=\"6475\",ModelNo=\"8402\",ModelNo=\"8405\",ModelNo=\"8406\",ModelNo=\"8408\",ModelNo=\"8475\"),2,\"\")","v":""},"6402","Sash Height",{"$f":"Frame_Height-3.375","v":-3.375}]
[{"$f":"IF(OR(ModelNo=\"6402\",ModelNo=\"6405\",ModelNo=\"6406\",ModelNo=\"6408\",ModelNo=\"6475\",ModelNo=\"8402\",ModelNo=\"8405\",ModelNo=\"8406\",ModelNo=\"8408\",ModelNo=\"8475\"),3,\"\")","v":""},"6402","Operating Sash Roller Track Length",{"$f":"IF(TYPE=3,Frame_Width-8.1875,Frame_Width-4.0625)","v":-4.0625}]
[{"$f":"IF(OR(ModelNo=\"6402\",ModelNo=\"6405\",ModelNo=\"6406\",ModelNo=\"6408\",ModelNo=\"6475\",ModelNo=\"8402\",ModelNo=\"8405\",ModelNo=\"8406\",ModelNo=\"8408\",ModelNo=\"8475\"),4,\"\")","v":""},"6402","Screen Roller Track Length (Sill)",{"$f":"IF(TYPE=3,Frame_Width-2.25,\"N/A\")","v":"N/A"}]
[{"$f":"IF(OR(ModelNo=\"6402\",ModelNo=\"6405\",ModelNo=\"6406\",ModelNo=\"6408\",ModelNo=\"6475\",ModelNo=\"8402\",ModelNo=\"8405\",ModelNo=\"8406\",ModelNo=\"8408\",ModelNo=\"8475\"),5,\"\")","v":""},"6402","Screen Roller Track Length (Head)",{"$f":"Frame_Width-3.0625","v":-3.0625}]
[{"$f":"IF(OR(ModelNo=\"6402\",ModelNo=\"6405\",ModelNo=\"6406\",ModelNo=\"6408\",ModelNo=\"6475\",ModelNo=\"8402\",ModelNo=\"8405\",ModelNo=\"8406\",ModelNo=\"8408\",ModelNo=\"8475\"),6,\"\")","v":""},"6402","Fixed Panel Support",{"$f":"IF(TYPE=1,TRUNC(((Frame_Width/2)-0.8125)*16+0.5)/16,IF(TYPE=2,TRUNC(((Frame_Width/2))*32+0.5)/32,IF(TYPE=3,TRUNC(((Frame_Width/2)-10)*32+0.5)/32,\"\")))","v":-0.75}]
[{"$f":"IF(OR(ModelNo=\"6402\",ModelNo=\"6405\",ModelNo=\"6406\",ModelNo=\"6408\",ModelNo=\"6475\",ModelNo=\"8402\",ModelNo=\"8405\",ModelNo=\"8406\",ModelNo=\"8408\",ModelNo=\"8475\"),7,\"\")","v":""},"6402","Glass Width",{"$f":"IF(TYPE=2,TRUNC(((Frame_Width/2)-7.875)*16+0.5)/16,TRUNC(((Frame_Width/2)-5.1875)*16+0.5)/16)","v":-5.125}]
[{"$f":"IF(OR(ModelNo=\"6402\",ModelNo=\"6405\",ModelNo=\"6406\",ModelNo=\"6408\",ModelNo=\"6475\",ModelNo=\"8402\",ModelNo=\"8405\",ModelNo=\"8406\",ModelNo=\"8408\",ModelNo=\"8475\"),8,\"\")","v":""},"6402","Glass Height",{"$f":"IF(TYPE=1,TRUNC((Frame_Height-8.6875)*16+0.5)/16,IF(TYPE=2,TRUNC((Frame_Height-12.1875)*32+0.5)/32,IF(TYPE=3,TRUNC((Frame_Height-14.1875)*32+0.5)/32,\"\")))","v":-8.625}]
[{"$f":"IF(OR(ModelNo=\"6402\",ModelNo=\"6405\",ModelNo=\"6406\",ModelNo=\"6408\",ModelNo=\"6475\",ModelNo=\"8402\",ModelNo=\"8405\",ModelNo=\"8406\",ModelNo=\"8408\",ModelNo=\"8475\"),9,\"\")","v":""},"6402","Screen Width",{"$f":"(Frame_Width/2)-0.125","v":-0.125}]
[{"$f":"IF(OR(ModelNo=\"6402\",ModelNo=\"6405\",ModelNo=\"6406\",ModelNo=\"6408\",ModelNo=\"6475\",ModelNo=\"8402\",ModelNo=\"8405\",ModelNo=\"8406\",ModelNo=\"8408\",ModelNo=\"8475\"),10,\"\")","v":""},"6402","Screen Height",{"$f":"IF(TYPE=3,Frame_Height-2.9375,Frame_Height-2.5625)","v":-2.5625}]
[{"$f":"IF(OR(ModelNo=\"6402\",ModelNo=\"6405\",ModelNo=\"6406\",ModelNo=\"6408\",ModelNo=\"6475\",ModelNo=\"8402\",ModelNo=\"8405\",ModelNo=\"8406\",ModelNo=\"8408\",ModelNo=\"8475\"),11,\"\")","v":""},"6402","Egress Opening Width",{"$f":"TRUNC((Frame_Width-D230-(2.176*2)-4)*16+0.5)/16","v":-8.5}]
[{"$f":"IF(OR(ModelNo=\"6402\",ModelNo=\"6405\",ModelNo=\"6406\",ModelNo=\"6408\",ModelNo=\"6475\",ModelNo=\"8402\",ModelNo=\"8405\",ModelNo=\"8406\",ModelNo=\"8408\",ModelNo=\"8475\"),12,\"\")","v":""},"6402","Egress Opening Height",{"$f":"Frame_Height-(2.25*2)","v":-4.5}]
[{"$f":"IF(OR(ModelNo=\"6402\",ModelNo=\"6405\",ModelNo=\"6406\",ModelNo=\"6408\",ModelNo=\"6475\",ModelNo=\"8402\",ModelNo=\"8405\",ModelNo=\"8406\",ModelNo=\"8408\",ModelNo=\"8475\"),13,\"\")","v":""},"6402","Egress Opening Area (sq.ft.)",{"$f":"(D240*D241)/144","v":0.265625}]
[{"$f":"IF(OR(ModelNo=\"6403\",ModelNo=\"6409\",ModelNo=\"6422\",ModelNo=\"8403\",ModelNo=\"8409\",ModelNo=\"8422\"),1,\"\")","v":""},"6403","Sash Width",{"$f":"IF(TYPE=2,TRUNC(((Frame_Width/3)+0.958)*16+0.5)/16,TRUNC(((Frame_Width/3)+0.333)*16+0.5)/16)","v":0.3125}]
[{"$f":"IF(OR(ModelNo=\"6403\",ModelNo=\"6409\",ModelNo=\"6422\",ModelNo=\"8403\",ModelNo=\"8409\",ModelNo=\"8422\"),2,\"\")","v":""},"6403","Sash Height",{"$f":"Frame_Height-3.375","v":-3.375}]
[{"$f":"IF(OR(ModelNo=\"6403\",ModelNo=\"6409\",ModelNo=\"6422\",ModelNo=\"8403\",ModelNo=\"8409\",ModelNo=\"8422\"),3,\"\")","v":""},"6403","Operating Sash Roller Track Length",{"$f":"IF(TYPE=3,Frame_Width-12.375,Frame_Width-4.0625)","v":-4.0625}]
[{"$f":"IF(OR(ModelNo=\"6403\",ModelNo=\"6409\",ModelNo=\"6422\",ModelNo=\"8403\",ModelNo=\"8409\",ModelNo=\"8422\"),4,\"\")","v":""},"6403","Screen Roller Track Length (Sill)",{"$f":"IF(TYPE=3,Frame_Width-2.25,\"N/A\")","v":"N/A"}]
[{"$f":"IF(OR(ModelNo=\"6403\",ModelNo=\"6409\",ModelNo=\"6422\",ModelNo=\"8403\",ModelNo=\"8409\",ModelNo=\"8422\"),5,\"\")","v":""},"6403","Screen Roller Track Length (Head)",{"$f":"Frame_Width-3.0625","v":-3.0625}]
[{"$f":"IF(OR(ModelNo=\"6403\",ModelNo=\"6409\",ModelNo=\"6422\",ModelNo=\"8403\",ModelNo=\"8409\",ModelNo=\"8422\"),6,\"\")","v":""},"6403","Fixed Panel Support",{"$f":"IF(TYPE=1,TRUNC(((Frame_Width/3)-0.541)*16+0.5)/16,IF(TYPE=2,TRUNC(((Frame_Width/3)+0.042)*32+0.5)/32,IF(TYPE=3,TRUNC(((Frame_Width/3)-9.854)*32+0.5)/32,\"\")))","v":-0.5}]
[{"$f":"IF(OR(ModelNo=\"6403\",ModelNo=\"6409\",ModelNo=\"6422\",ModelNo=\"8403\",ModelNo=\"8409\",ModelNo=\"8422\"),7,\"\")","v":""},"6403","Glass Width",{"$f":"IF(TYPE=2,TRUNC(((Frame_Width/3)-7.917)*16+0.5)/16,TRUNC(((Frame_Width/3)-5.042)*16+0.5)/16)","v":-5}]
[{"$f":"IF(OR(ModelNo=\"6403\",ModelNo=\"6409\",ModelNo=\"6422\",ModelNo=\"8403\",ModelNo=\"8409\",ModelNo=\"8422\"),8,\"\")","v":""},"6403","Glass Height",{"$f":"IF(TYPE=1,TRUNC((Frame_Height-8.6875)*16+0.5)/16,IF(TYPE=2,TRUNC((Frame_Height-12.1875)*32+0.5)/32,IF(TYPE=3,TRUNC((Frame_Height-14.1875)*32+0.5)/32,\"\")))","v":-8.625}]
[{"$f":"IF(OR(ModelNo=\"6403\",ModelNo=\"6409\",ModelNo=\"6422\",ModelNo=\"8403\",ModelNo=\"8409\",ModelNo=\"8422\"),9,\"\")","v":""},"6403","Screen Width",{"$f":"TRUNC(((Frame_Width/3)+0.021)*16+0.5)/16","v":0}]
[{"$f":"IF(OR(ModelNo=\"6403\",ModelNo=\"6409\",ModelNo=\"6422\",ModelNo=\"8403\",ModelNo=\"8409\",ModelNo=\"8422\"),10,\"\")","v":""},"6403","Screen Height",{"$f":"IF(TYPE=3,Frame_Height-2.9375,Frame_Height-2.5625)","v":-2.5625}]
[{"$f":"IF(OR(ModelNo=\"6403\",ModelNo=\"6409\",ModelNo=\"6422\",ModelNo=\"8403\",ModelNo=\"8409\",ModelNo=\"8422\"),11,\"\")","v":""},"6403","Egress Opening Width",{"$f":"(TRUNC((Frame_Width-(D243*2)-(2.176*2)-4)*16+0.5)/16)+0.875","v":-8.0625}]
[{"$f":"IF(OR(ModelNo=\"6403\",ModelNo=\"6409\",ModelNo=\"6422\",ModelNo=\"8403\",ModelNo=\"8409\",ModelNo=\"8422\"),12,\"\")","v":""},"6403","Egress Opening Height",{"$f":"Frame_Height-(2.25*2)","v":-4.5}]
[{"$f":"IF(OR(ModelNo=\"6403\",ModelNo=\"6409\",ModelNo=\"6422\",ModelNo=\"8403\",ModelNo=\"8409\",ModelNo=\"8422\"),13,\"\")","v":""},"6403","Egress Opening Area (sq.ft.)",{"$f":"(D253*D254)/144","v":0.251953125}]
[{"$f":"IF(OR(ModelNo=\"6403\",ModelNo=\"6409\",ModelNo=\"6422\",ModelNo=\"8403\",ModelNo=\"8409\",ModelNo=\"8422\"),14,\"\")","v":""},"6403","Center of Meeting Rail (Lock side)",{"$f":"(TRUNC((Frame_Width/3)*16+0.5)/16)+1.3125","v":1.3125}]
[{"$f":"IF(OR(ModelNo=\"6403\",ModelNo=\"6409\",ModelNo=\"6422\",ModelNo=\"8403\",ModelNo=\"8409\",ModelNo=\"8422\"),15,\"\")","v":""},"6403","Center of Meeting Rail (Mullion side)",{"$f":"(TRUNC((Frame_Width/3)*16+0.5)/16)-0.125","v":-0.125}]
[{"$f":"IF(OR(ModelNo=\"6404\",ModelNo=\"6412\",ModelNo=\"8404\",ModelNo=\"8412\"),1,\"\")","v":""},"6404","Sash Width",{"$f":"IF(TYPE=2,TRUNC(((Frame_Width/4)+1.4375)*16+0.5)/16,TRUNC(((Frame_Width/4)+0.625)*16+0.5)/16)","v":0.625}]
[{"$f":"IF(OR(ModelNo=\"6404\",ModelNo=\"6412\",ModelNo=\"8404\",ModelNo=\"8412\"),2,\"\")","v":""},"6404","Sash Height",{"$f":"Frame_Height-3.375","v":-3.375}]
[{"$f":"IF(OR(ModelNo=\"6404\",ModelNo=\"6412\",ModelNo=\"8404\",ModelNo=\"8412\"),3,\"\")","v":""},"6404","Operating Sash Roller Track Length",{"$f":"IF(TYPE=3,Frame_Width-12.375,Frame_Width-4.0625)","v":-4.0625}]
[{"$f":"IF(OR(ModelNo=\"6404\",ModelNo=\"6412\",ModelNo=\"8404\",ModelNo=\"8412\"),4,\"\")","v":""},"6404","Screen Roller Track Length (Sill)",{"$f":"IF(TYPE=3,Frame_Width-2.25,\"N/A\")","v":"N/A"}]
[{"$f":"IF(OR(ModelNo=\"6404\",ModelNo=\"6412\",ModelNo=\"8404\",ModelNo=\"8412\"),5,\"\")","v":""},"6404","Screen Roller Track Length (Head)",{"$f":"Frame_Width-3.0625","v":-3.0625}]
[{"$f":"IF(OR(ModelNo=\"6404\",ModelNo=\"6412\",ModelNo=\"8404\",ModelNo=\"8412\"),6,\"\")","v":""},"6404","Fixed Panel Support",{"$f":"IF(TYPE=1,TRUNC(((Frame_Width/4)-0.375)*16+0.5)/16,IF(TYPE=2,TRUNC(((Frame_Width/4)+0.437)*32+0.5)/32,IF(TYPE=3,TRUNC(((Frame_Width/4)-9.5625)*32+0.5)/32,\"\")))","v":-0.3125}]
[{"$f":"IF(OR(ModelNo=\"6404\",ModelNo=\"6412\",ModelNo=\"8404\",ModelNo=\"8412\"),7,\"\")","v":""},"6404","Glass Width",{"$f":"IF(TYPE=2,TRUNC(((Frame_Width/4)-7.4375)*16+0.5)/16,TRUNC(((Frame_Width/4)-4.75)*16+0.5)/16)","v":-4.6875}]
[{"$f":"IF(OR(ModelNo=\"6404\",ModelNo=\"6412\",ModelNo=\"8404\",ModelNo=\"8412\"),8,\"\")","v":""},"6404","Glass Height",{"$f":"IF(TYPE=1,TRUNC((Frame_Height-8.6875)*16+0.5)/16,IF(TYPE=2,TRUNC((Frame_Height-12.1875)*32+0.5)/32,IF(TYPE=3,TRUNC((Frame_Height-14.1875)*32+0.5)/32,\"\")))","v":-8.625}]
[{"$f":"IF(OR(ModelNo=\"6404\",ModelNo=\"6412\",ModelNo=\"8404\",ModelNo=\"8412\"),9,\"\")","v":""},"6404","Screen Width",{"$f":"TRUNC(((Frame_Width/4)+0.3125)*16+0.5)/16","v":0.3125}]
[{"$f":"IF(OR(ModelNo=\"6404\",ModelNo=\"6412\",ModelNo=\"8404\",ModelNo=\"8412\"),10,\"\")","v":""},"6404","Screen Height",{"$f":"IF(TYPE=3,Frame_Height-2.9375,Frame_Height-2.5625)","v":-2.5625}]
[{"$f":"IF(OR(ModelNo=\"6404\",ModelNo=\"6412\",ModelNo=\"8404\",ModelNo=\"8412\"),11,\"\")","v":""},"6404","Egress Opening Width",{"$f":"TRUNC(((Frame_Width-(D258+4.375)*2)-2.1875)*16+0.5)/16","v":-12.125}]
[{"$f":"IF(OR(ModelNo=\"6404\",ModelNo=\"6412\",ModelNo=\"8404\",ModelNo=\"8412\"),12,\"\")","v":""},"6404","Egress Opening Height",{"$f":"Frame_Height-(2.25*2)","v":-4.5}]
[{"$f":"IF(OR(ModelNo=\"6404\",ModelNo=\"6412\",ModelNo=\"8404\",ModelNo=\"8412\"),13,\"\")","v":""},"6404","Egress Opening Area (sq.ft.)",{"$f":"(D268*D269)/144","v":0.37890625}]
[{"$f":"IF(OR(ModelNo=\"6404\",ModelNo=\"6412\",ModelNo=\"8404\",ModelNo=\"8412\"),14,\"\")","v":""},"6404","Center of Meeting Rail (Left & Right)",{"$f":"(Frame_Width/4)+0.125","v":0.125}]
[{"$f":"IF(ModelNo=B272,1,\"\")","v":""},"3001","Top Sash Width",{"$f":"Frame_Width-4.125","v":-4.125}]
[{"$f":"IF(ModelNo=B273,2,\"\")","v":""},"3001","Top Sash Height",{"$f":"DDIM_3001-1.625","v":-1.625}]
[{"$f":"IF(ModelNo=B274,3,\"\")","v":""},"3001","Bottom Sash Width",{"$f":"Frame_Width-3.125","v":-3.125}]
[{"$f":"IF(ModelNo=B275,4,\"\")","v":""},"3001","Bottom Sash Height",{"$f":"CDIM_3001-0.625","v":-0.625}]
[{"$f":"IF(ModelNo=B276,5,\"\")","v":""},"3001","Top Glass Width",{"$f":"TRUNC((Frame_Width-4.03125)*32+0.5)/32","v":-4}]
[{"$f":"IF(ModelNo=B277,6,\"\")","v":""},"3001","Top Glass Height",{"$f":"TRUNC((DDIM_3001-3.0625)*32+0.5)/32","v":-3.03125}]
[{"$f":"IF(ModelNo=B278,7,\"\")","v":""},"3001","Bottom Glass Width",{"$f":"TRUNC((Frame_Width-4.76815)*32+0.5)/32","v":-4.75}]
[{"$f":"IF(ModelNo=B279,8,\"\")","v":""},"3001","Bottom Glass Height",{"$f":"TRUNC((CDIM_3001-3.00375)*32+0.5)/32","v":-2.96875}]
[{"$f":"IF(ModelNo=B280,9,\"\")","v":""},"3001","Top Sash Stop Length",{"$f":"SASHSTOP3001","v":7}]
[{"$f":"IF(ModelNo=B281,10,\"\")","v":""},"3001","Screen Width",{"$f":"IF(Screen=\"H\",Frame_Width-4.5,Frame_Width-4.5625)","v":-4.5}]
[{"$f":"IF(ModelNo=B282,11,\"\")","v":""},"3001","Screen Height",{"$f":"IF(Screen=\"L\",TRUNC((CDIM_3001-0.75)*16+0.5)/16,IF(Screen=\"F\",TRUNC((Frame_Height-3.3125)*16+0.5)/16,TRUNC((CDIM_3001-0.75)*16+0.5)/16))","v":-0.6875}]
[{"$f":"IF(ModelNo=B283,12,\"\")","v":""},"3001","Top Sash Weight (Plus 1 lb)",{"$f":"IF(ISERROR(TOP_WGT&\" \"&\"lb\"),\"N/A\",TOP_WGT&\" \"&\"lb\")","v":"0 lb"}]
[{"$f":"IF(ModelNo=B284,13,\"\")","v":""},"3001","Top Balance Size (C.F)",{"$f":"IF(ISERROR((VLOOKUP(TOP_WGT,CFB,2,FALSE))),\"N/A\",(VLOOKUP(TOP_WGT,CFB,2,FALSE)))","v":"N/A"}]
[{"$f":"IF(ModelNo=B285,14,\"\")","v":""},"3001","Bottom Sash Weight",{"$f":"IF(ISERROR(BTM_WGT&\" \"&\"lb\"),\"N/A\",BTM_WGT&\" \"&\"lb\")","v":"0 lb"}]
[{"$f":"IF(ModelNo=B286,15,\"\")","v":""},"3001","Bottom Balance Size (C.F)",{"$f":"IF(ISERROR((VLOOKUP(BTM_WGT,CFB,2,FALSE))),\"N/A\",(VLOOKUP(BTM_WGT,CFB,2,FALSE)))","v":"N/A"}]
[{"$f":"IF(ModelNo=B287,16,\"\")","v":""},"3001","Egress Opening Width",{"$f":"IF(ISERROR(EW),\"N/A\",EW)","v":0}]
[{"$f":"IF(ModelNo=B288,17,\"\")","v":""},"3001","Egress Opening Height",{"$f":"IF(ISERROR(EH),\"N/A\",EH)","v":0}]
[{"$f":"IF(ModelNo=B289,18,\"\")","v":""},"3001","Egress Opening Area (sq.ft.)",{"$f":"(D287*D288)/144","v":0}]
[{"$f":"IF(ModelNo=B290,1,\"\")","v":""},"03A0","Bottom Sash Width",{"$f":"Frame_Width-3.125","v":-3.125}]
[{"$f":"IF(ModelNo=B291,2,\"\")","v":""},"03A0","Bottom Sash Height",{"$f":"CDIM_03A0-1.125","v":-1.125}]
[{"$f":"IF(ModelNo=B292,3,\"\")","v":""},"03A0","Bottom Glass Width",{"$f":"TRUNC((Frame_Width-4.8125)*16+0.5)/16","v":-4.75}]
[{"$f":"IF(ModelNo=B293,4,\"\")","v":""},"03A0","Bottom Glass Height",{"$f":"TRUNC((CDIM_03A0-2.75)*32+0.5)/32","v":-2.71875}]
[{"$f":"IF(ModelNo=B294,5,\"\")","v":""},"03A0","Top Glass Width",{"$f":"TRUNC((Frame_Width-4.75)*16+0.5)/16","v":-4.6875}]
[{"$f":"IF(ModelNo=B295,6,\"\")","v":""},"03A0","Top Glass Height",{"$f":"TRUNC((DDIM_03A0-2.625)*32+0.5)/32","v":-2.59375}]
[{"$f":"IF(ModelNo=B296,7,\"\")","v":""},"03A0","Astragal Length",{"$f":"TRUNC((Frame_Width-4.125)*16+0.5)/16","v":-4.0625}]
[{"$f":"IF(ModelNo=B297,8,\"\")","v":""},"03A0","Screen Width",{"$f":"Frame_Width-4.5","v":-4.5}]
[{"$f":"IF(ModelNo=B298,9,\"\")","v":""},"03A0","Screen Height",{"$f":"IF(Screen=\"F\",Frame_Height-3.3125,IF(Screen=\"L\",CDIM_03A0-1.0625,CDIM_03A0-1.3125))","v":-1.3125}]
[{"$f":"IF(ModelNo=B299,10,\"\")","v":""},"03A0","Bottom Sash Weight",{"$f":"IF(ISERROR(BTM_WGT&\" \"&\"lb\"),\"N/A\",BTM_WGT&\" \"&\"lb\")","v":"0 lb"}]
[{"$f":"IF(ModelNo=B300,11,\"\")","v":""},"03A0","Balance Size",{"$f":"IF(ISERROR((VLOOKUP(BTM_WGT,CFB,2,FALSE))&(VLOOKUP(BTM_WGT,CFB,3,FALSE))),\"N/A\",(VLOOKUP(BTM_WGT,CFB,2,FALSE)))","v":"N/A"}]
[{"$f":"IF(ModelNo=B301,12,\"\")","v":""},"03A0","Egress Opening Width",{"$f":"IF(ISERROR(EW),\"N/A\",EW)","v":0}]
[{"$f":"IF(ModelNo=B302,13,\"\")","v":""},"03A0","Egress Opening Height",{"$f":"IF(ISERROR(EH),\"N/A\",EH)","v":0}]
[{"$f":"IF(ModelNo=B303,14,\"\")","v":""},"03A0","Egress Opening Area (sq.ft.)",{"$f":"(D301*D302)/144","v":0}]
[{"$f":"IF(ModelNo=B304,1,\"\")","v":""},"3002","Sash Width",{"$f":"(Frame_Width/2)-0.875","v":-0.875}]
[{"$f":"IF(ModelNo=B305,2,\"\")","v":""},"3002","Sash Height",{"$f":"Frame_Height-3.8125","v":-3.8125}]
[{"$f":"IF(ModelNo=B306,3,\"\")","v":""},"3002","Roller Track Length",{"$f":"Frame_Width-2.6875","v":-2.6875}]
[{"$f":"IF(ModelNo=B307,4,\"\")","v":""},"3002","Glass Width",{"$f":"(Frame_Width/2)-2.5625","v":-2.5625}]
[{"$f":"IF(ModelNo=B308,5,\"\")","v":""},"3002","Glass Height",{"$f":"Frame_Height-5.4375","v":-5.4375}]
[{"$f":"IF(ModelNo=B309,6,\"\")","v":""},"3002","Screen Width",{"$f":"IF(Screen=\"F\",Frame_Width-5,IF(Screen=\"L\",\"N/A\",(Frame_Width/2)-2.4375))","v":-2.4375}]
[{"$f":"IF(ModelNo=B310,7,\"\")","v":""},"3002","Screen Height",{"$f":"Frame_Height-4.5625","v":-4.5625}]
[{"$f":"IF(ModelNo=B311,8,\"\")","v":""},"3002","Egress Opening Width",{"$f":"(Frame_Width/2)-4.75","v":-4.75}]
[{"$f":"IF(ModelNo=B312,9,\"\")","v":""},"3002","Egress Opening Height",{"$f":"Frame_Height-5.25","v":-5.25}]
[{"$f":"IF(ModelNo=B313,10,\"\")","v":""},"3002","Egress Opening Area (sq.ft.)",{"$f":"(D311*D312)/144","v":0.17317708333333334}]
[{"$f":"IF(ModelNo=B314,1,\"\")","v":""},"3003","Operating Sash Width",{"$f":"TRUNC((((Frame_Width/4)+0.1875))*16+0.5)/16","v":0.1875}]
[{"$f":"IF(ModelNo=B315,2,\"\")","v":""},"3003","Operating Sash Height",{"$f":"Frame_Height-3.8125","v":-3.8125}]
[{"$f":"IF(ModelNo=B316,3,\"\")","v":""},"3003","Fixed Sash Width",{"$f":"(Frame_Width-(2*(TRUNC((((Frame_Width/4)+1))*16+0.5)/16)))+0.75","v":-1.25}]
[{"$f":"IF(ModelNo=B317,4,\"\")","v":""},"3003","Fixed Sash Height",{"$f":"Frame_Height-3.8125","v":-3.8125}]
[{"$f":"IF(ModelNo=B318,5,\"\")","v":""},"3003","Roller Track Length",{"$f":"Frame_Width-2.6875","v":-2.6875}]
[{"$f":"IF(ModelNo=B319,6,\"\")","v":""},"3003","Operating Sash Glass Width",{"$f":"TRUNC(((TRUNC((((Frame_Width/4)+0.1875))*16+0.5)/16)-1.6875)*16+0.5)/16","v":-1.4375}]
[{"$f":"IF(ModelNo=B320,7,\"\")","v":""},"3003","Operating Sash Glass Height",{"$f":"Frame_Height-5.4375","v":-5.4375}]
[{"$f":"IF(ModelNo=B321,8,\"\")","v":""},"3003","Fixed Sash Glass Width",{"$f":"TRUNC((((Frame_Width-(2*(TRUNC((((Frame_Width/4)+1))*16+0.5)/16)))+0.75)-1.6875)*16+0.5)/16","v":-2.875}]
[{"$f":"IF(ModelNo=B322,9,\"\")","v":""},"3003","Fixed Sash Glass Height",{"$f":"Frame_Height-5.4375","v":-5.4375}]
[{"$f":"IF(ModelNo=B323,10,\"\")","v":""},"3003","Screen Width",{"$f":"IF(Screen=\"F\",Frame_Width-5,IF(Screen=\"L\",\"N/A\",TRUNC(((Frame_Width/4)-1.25)*16+0.5)/16))","v":-1.1875}]
[{"$f":"IF(ModelNo=B324,11,\"\")","v":""},"3003","Screen Height",{"$f":"Frame_Height-4.5625","v":-4.5625}]
[{"$f":"IF(ModelNo=B325,12,\"\")","v":""},"3003","Egress Opening Width",{"$f":"(Frame_Width/4)-2.25","v":-2.25}]
[{"$f":"IF(ModelNo=B326,13,\"\")","v":""},"3003","Egress Opening Height",{"$f":"Frame_Height-5.25","v":-5.25}]
[{"$f":"IF(ModelNo=B327,14,\"\")","v":""},"3003","Egress Opening Area (sq.ft.)",{"$f":"(D325*D326)/144","v":8.203125E-2}]
[{"$f":"IF(ModelNo=B328,15,\"\")","v":""},"3003","Center of Meeting Rail from Edge of Frame",{"$f":"(Frame_Width/4)+1.0625","v":1.0625}]
[{"$f":"IF(OR(ModelNo=\"3004\",ModelNo=\"03A4\"),1,\"\")","v":""},"3004","Glass Width",{"$f":"Frame_Width-4.1875","v":-4.1875}]
[{"$f":"IF(OR(ModelNo=\"3004\",ModelNo=\"03A4\"),2,\"\")","v":""},"3004","Glass Height",{"$f":"Frame_Height-4.1875","v":-4.1875}]
[{"$f":"IF(OR(ModelNo=\"3004\",ModelNo=\"03A4\"),3,\"\")","v":""},"3004","Glass Area (sq.ft.)",{"$f":"(D329*D330)/144","v":0.12177191840277778}]
[{"$f":"IF(ModelNo=B332,1,\"\")","v":""},"3009","Operating Sash Width",{"$f":"TRUNC(((Frame_Width/3)-0.3125)*16+0.5)/16","v":-0.25}]
[{"$f":"IF(ModelNo=B333,2,\"\")","v":""},"3009","Operating Sash Height",{"$f":"Frame_Height-3.8125","v":-3.8125}]
[{"$f":"IF(ModelNo=B334,3,\"\")","v":""},"3009","Fixed Sash Width",{"$f":"TRUNC(((Frame_Width/3)-0.25)*16+0.5)/16","v":-0.1875}]
[{"$f":"IF(ModelNo=B335,4,\"\")","v":""},"3009","Fixed Sash Height",{"$f":"Frame_Height-3.8125","v":-3.8125}]
[{"$f":"IF(ModelNo=B336,5,\"\")","v":""},"3009","Roller Track Length",{"$f":"Frame_Width-2.6875","v":-2.6875}]
[{"$f":"IF(ModelNo=B337,6,\"\")","v":""},"3009","Operating Sash Glass Width",{"$f":"D332-1.6875","v":-1.9375}]
[{"$f":"IF(ModelNo=B338,7,\"\")","v":""},"3009","Operating Sash Glass Height",{"$f":"D333-1.625","v":-5.4375}]
[{"$f":"IF(ModelNo=B339,8,\"\")","v":""},"3009","Fixed Sash Glass Width",{"$f":"D334-1.6875","v":-1.875}]
[{"$f":"IF(ModelNo=B340,9,\"\")","v":""},"3009","Fixed Sash Glass Height",{"$f":"D335-1.625","v":-5.4375}]
[{"$f":"IF(ModelNo=B341,10,\"\")","v":""},"3009","Screen Width",{"$f":"IF(Screen=\"F\",Frame_Width-5,IF(Screen=\"L\",\"N/A\",TRUNC((Frame_Width/3+0.625)*16+0.5)/16-2.375))","v":-1.75}]
[{"$f":"IF(ModelNo=B342,11,\"\")","v":""},"3009","Screen Height",{"$f":"Frame_Height-4.5625","v":-4.5625}]
[{"$f":"IF(ModelNo=B343,12,\"\")","v":""},"3009","Egress Opening Width",{"$f":"(Frame_Width/3)-4.375","v":-4.375}]
[{"$f":"IF(ModelNo=B344,13,\"\")","v":""},"3009","Egress Opening Height",{"$f":"Frame_Height-5.25","v":-5.25}]
[{"$f":"IF(ModelNo=B345,14,\"\")","v":""},"3009","Egress Opening Area (sq.ft.)",{"$f":"(D343*D344)/144","v":0.15950520833333334}]
[{"$f":"IF(ModelNo=B346,15,\"\")","v":""},"3009","Center of Meeting Rail from Edge of Frame",{"$f":"(TRUNC((Frame_Width/3)*16+0.5)/16)+0.5625","v":0.5625}]
[{"$f":"IF(ModelNo=B347,1,\"\")","v":""},"03A2","Sash Width",{"$f":"TRUNC(((Frame_Width/2)-1.0625)*16+0.5)/16","v":-1}]
[{"$f":"IF(ModelNo=B348,2,\"\")","v":""},"03A2","Sash Height",{"$f":"Frame_Height-3.0625","v":-3.0625}]
[{"$f":"IF(ModelNo=B349,3,\"\")","v":""},"03A2","Roller Track Length",{"$f":"Frame_Width-1.9375","v":-1.9375}]
[{"$f":"IF(ModelNo=B350,4,\"\")","v":""},"03A2","Sash Glass Width",{"$f":"TRUNC(((Frame_Width/2)-2.75)*16+0.5)/16","v":-2.6875}]
[{"$f":"IF(ModelNo=B351,5,\"\")","v":""},"03A2","Sash Glass Height",{"$f":"Frame_Height-4.6875","v":-4.6875}]
[{"$f":"IF(ModelNo=B352,6,\"\")","v":""},"03A2","Fixed Glass Width",{"$f":"TRUNC(((Frame_Width/2)-2.625)*16+0.5)/16","v":-2.5625}]
[{"$f":"IF(ModelNo=B353,7,\"\")","v":""},"03A2","Fixed Glass Height",{"$f":"TRUNC((Frame_Height-4.8125)*16+0.5)/16","v":-4.75}]
[{"$f":"IF(ModelNo=B354,8,\"\")","v":""},"03A2","Screen Width",{"$f":"IF(Screen=\"F\",Frame_Width-5,IF(Screen=\"L\",\"N/A\",TRUNC(((Frame_Width/2)-3.0625)*16+0.5)/16))","v":-3}]
[{"$f":"IF(ModelNo=B355,9,\"\")","v":""},"03A2","Screen Height",{"$f":"Frame_Height-4.5625","v":-4.5625}]
[{"$f":"IF(ModelNo=B356,10,\"\")","v":""},"03A2","Egress Opening Width",{"$f":"(Frame_Width/2)-4.75","v":-4.75}]
[{"$f":"IF(ModelNo=B357,11,\"\")","v":""},"03A2","Egress Opening Height",{"$f":"Frame_Height-5.875","v":-5.875}]
[{"$f":"IF(ModelNo=B358,12,\"\")","v":""},"03A2","Egress Opening Area (sq.ft.)",{"$f":"(D356*D357)/144","v":0.19379340277777779}]
[{"$f":"IF(ModelNo=B359,1,\"\")","v":""},"03A3","Operating Sash Width",{"$f":"TRUNC((((Frame_Width/4)+0.1875))*16+0.5)/16","v":0.1875}]
[{"$f":"IF(ModelNo=B360,2,\"\")","v":""},"03A3","Operating Sash Height",{"$f":"Frame_Height-3.0625","v":-3.0625}]
[{"$f":"IF(ModelNo=B361,3,\"\")","v":""},"03A3","Roller Track Length",{"$f":"Frame_Width-1.9375","v":-1.9375}]
[{"$f":"IF(ModelNo=B362,4,\"\")","v":""},"03A3","Operating Sash Glass Width",{"$f":"D359-1.6875","v":-1.5}]
[{"$f":"IF(ModelNo=B363,5,\"\")","v":""},"03A3","Operating Sash Glass Height",{"$f":"Frame_Height-4.6875","v":-4.6875}]
[{"$f":"IF(ModelNo=B364,6,\"\")","v":""},"03A3","Fixed Sash Glass Width",{"$f":"(Frame_Width-2*(TRUNC((Frame_Width/4+0.6875)*16+0.5)/16))-1.625","v":-3}]
[{"$f":"IF(ModelNo=B365,7,\"\")","v":""},"03A3","Fixed Sash Glass Height",{"$f":"Frame_Height-4.8125","v":-4.8125}]
[{"$f":"IF(ModelNo=B366,8,\"\")","v":""},"03A3","Screen Width",{"$f":"IF(Screen=\"F\",Frame_Width-5,IF(Screen=\"L\",\"N/A\",(TRUNC((Frame_Width/4+0.6875)*16+0.5)/16)-2.5))","v":-1.8125}]
[{"$f":"IF(ModelNo=B367,9,\"\")","v":""},"03A3","Screen Height",{"$f":"Frame_Height-4.5625","v":-4.5625}]
[{"$f":"IF(ModelNo=B368,10,\"\")","v":""},"03A3","Egress Opening Width",{"$f":"(Frame_Width/4)-2.875","v":-2.875}]
[{"$f":"IF(ModelNo=B369,11,\"\")","v":""},"03A3","Egress Opening Height",{"$f":"Frame_Height-5.875","v":-5.875}]
[{"$f":"IF(ModelNo=B370,12,\"\")","v":""},"03A3","Egress Opening Area (sq.ft.)",{"$f":"(D368*D369)/144","v":0.11729600694444445}]
[{"$f":"IF(ModelNo=B371,13,\"\")","v":""},"03A3","Center of Meeting Rail from Edge of Frame",{"$f":"(Frame_Width/4)+1","v":1}]
[{"$f":"IF(ModelNo=B372,1,\"\")","v":""},"03A9","Operating Sash Width",{"$f":"TRUNC(((Frame_Width/3)-0.3125)*16+0.5)/16","v":-0.25}]
[{"$f":"IF(ModelNo=B373,2,\"\")","v":""},"03A9","Operating Sash Height",{"$f":"Frame_Height-3.0625","v":-3.0625}]
[{"$f":"IF(ModelNo=B374,3,\"\")","v":""},"03A9","Roller Track Length",{"$f":"Frame_Width-1.9375","v":-1.9375}]
[{"$f":"IF(ModelNo=B375,4,\"\")","v":""},"03A9","Operating Sash Glass Width",{"$f":"TRUNC(((TRUNC(((Frame_Width/3)-0.3125)*16+0.5)/16)-1.6875)*16+0.5)/16","v":-1.875}]
[{"$f":"IF(ModelNo=B376,5,\"\")","v":""},"03A9","Operating Sash Glass Height",{"$f":"Frame_Height-4.6875","v":-4.6875}]
[{"$f":"IF(ModelNo=B377,6,\"\")","v":""},"03A9","Fixed Sash Glass Width",{"$f":"((Frame_Width-((TRUNC(((Frame_Width/3)+0.1875)*16+0.5)/16)*2))+1.1875)-2.8125","v":-2}]
[{"$f":"IF(ModelNo=B378,7,\"\")","v":""},"03A9","Fixed Sash Glass Height",{"$f":"Frame_Height-4.8125","v":-4.8125}]
[{"$f":"IF(ModelNo=B379,8,\"\")","v":""},"03A9","Screen Width",{"$f":"IF(Screen=\"F\",Frame_Width-5,IF(Screen=\"L\",\"N/A\",(TRUNC((Frame_Width/3+0.1875)*16+0.5)/16)-2.5))","v":-2.3125}]
[{"$f":"IF(ModelNo=B380,9,\"\")","v":""},"03A9","Screen Height",{"$f":"Frame_Height-4.5625","v":-4.5625}]
[{"$f":"IF(ModelNo=B381,10,\"\")","v":""},"03A9","Egress Opening Width",{"$f":"(Frame_Width/3)-4.375","v":-4.375}]
[{"$f":"IF(ModelNo=B382,11,\"\")","v":""},"03A9","Egress Opening Height",{"$f":"Frame_Height-5.875","v":-5.875}]
[{"$f":"IF(ModelNo=B383,12,\"\")","v":""},"03A9","Egress Opening Area (sq.ft.)",{"$f":"(D381*D382)/144","v":0.1784939236111111}]
[{"$f":"IF(ModelNo=B384,13,\"\")","v":""},"03A9","Center of Meeting Rail from Edge of Frame",{"$f":"(TRUNC((Frame_Width/3)*16+0.5)/16)+0.5","v":0.5}]
[{"$f":"IF(ModelNo=B385,1,\"\")","v":""},"L201","Top Sash Width",{"$f":"Frame_Width-3.25","v":-3.25}]
[{"$f":"IF(ModelNo=B386,2,\"\")","v":""},"L201","Top Sash Height",{"$f":"DDIM_L201-1.5625","v":-1.5625}]
[{"$f":"IF(ModelNo=B387,3,\"\")","v":""},"L201","Bottom Sash Width",{"$f":"Frame_Width-2.25","v":-2.25}]
[{"$f":"IF(ModelNo=B388,4,\"\")","v":""},"L201","Bottom Sash Height",{"$f":"CDIM_L201-0.5625","v":-0.5625}]
[{"$f":"IF(ModelNo=B389,5,\"\")","v":""},"L201","Top Glass Width",{"$f":"TRUNC((Frame_Width-4.9375)*16+0.5)/16","v":-4.875}]
[{"$f":"IF(ModelNo=B390,6,\"\")","v":""},"L201","Top Glass Height",{"$f":"TRUNC((DDIM_L201-3.21875)*32+0.5)/32","v":-3.1875}]
[{"$f":"IF(ModelNo=B391,7,\"\")","v":""},"L201","Bottom Glass Width",{"$f":"TRUNC((Frame_Width-3.9375)*16+0.5)/16","v":-3.875}]
[{"$f":"IF(ModelNo=B392,8,\"\")","v":""},"L201","Bottom Glass Height",{"$f":"TRUNC((CDIM_L201-2.21875)*32+0.5)/32","v":-2.1875}]
[{"$f":"IF(ModelNo=B393,9,\"\")","v":""},"L201","Screen Width",{"$f":"IF(Screen=\"L\",Frame_Width-1.6875,Frame_Width-3.6875)","v":-3.6875}]
[{"$f":"IF(ModelNo=B394,10,\"\")","v":""},"L201","Screen Height",{"$f":"IF(Screen=\"L\",TRUNC((CDIM_L201-1.375)*16+0.5)/16,IF(Screen=\"F\",TRUNC((Frame_Height-2.875)*16+0.5)/16,TRUNC((CDIM_L201-0.3125)*16+0.5)/16))","v":-0.25}]
[{"$f":"IF(ModelNo=B395,11,\"\")","v":""},"L201","Top Sash Weight (Plus 1 lb)",{"$f":"IF(ISERROR(TOP_WGT&\" \"&\"lb\"),\"N/A\",TOP_WGT&\" \"&\"lb\")","v":"0 lb"}]
[{"$f":"IF(ModelNo=B396,12,\"\")","v":""},"L201","Top Balance Size (C.F)",{"$f":"IF(ISERROR((VLOOKUP(TOP_WGT,CFB,2,FALSE))),\"N/A\",(VLOOKUP(TOP_WGT,CFB,2,FALSE)))","v":"N/A"}]
[{"$f":"IF(ModelNo=B397,13,\"\")","v":""},"L201","Bottom Sash Weight",{"$f":"IF(ISERROR(BTM_WGT&\" \"&\"lb\"),\"N/A\",BTM_WGT&\" \"&\"lb\")","v":"0 lb"}]
[{"$f":"IF(ModelNo=B398,14,\"\")","v":""},"L201","Bottom Balance Size (C.F)",{"$f":"IF(ISERROR((VLOOKUP(BTM_WGT,CFB,2,FALSE))),\"N/A\",(VLOOKUP(BTM_WGT,CFB,2,FALSE)))","v":"N/A"}]
[{"$f":"IF(ModelNo=B399,15,\"\")","v":""},"L201","Egress Opening Width",{"$f":"IF(ISERROR(EW),\"N/A\",EW)","v":0}]
[{"$f":"IF(ModelNo=B400,16,\"\")","v":""},"L201","Egress Opening Height",{"$f":"IF(ISERROR(EH),\"N/A\",EH)","v":0}]
[{"$f":"IF(ModelNo=B401,17,\"\")","v":""},"L201","Egress Opening Area (sq.ft.)",{"$f":"(D399*D400)/144","v":0}]
[{"$f":"IF(ModelNo=B402,1,\"\")","v":""},"1700","Bottom Sash Width",{"$f":"TRUNC((Frame_Width-2.188)*32+0.5)/32","v":-2.15625}]
[{"$f":"IF(ModelNo=B403,2,\"\")","v":""},"1700","Bottom Sash Height",{"$f":"TRUNC(((CDIM_1700-0.78125)*32+0.5))/32-0.0625","v":-0.8125}]
[{"$f":"IF(ModelNo=B404,3,\"\")","v":""},"1700","Bottom Glass Width",{"$f":"D402-1.3125","v":-3.46875}]
[{"$f":"IF(ModelNo=B405,4,\"\")","v":""},"1700","Bottom Glass Height",{"$f":"D403-1.3125","v":-2.125}]
[{"$f":"IF(ModelNo=B406,5,\"\")","v":""},"1700","Top Glass Width",{"$f":"TRUNC((Frame_Width-3.5)*32+0.5)/32","v":-3.46875}]
[{"$f":"IF(ModelNo=B407,6,\"\")","v":""},"1700","Top Glass Height",{"$f":"TRUNC((DDIM_1700-2.15625)*32+0.5)/32","v":-2.125}]
[{"$f":"IF(ModelNo=B408,7,\"\")","v":""},"1700","Astragal Length",{"$f":"TRUNC((Frame_Width-2.95)*16+0.5)/16","v":-2.875}]
[{"$f":"IF(ModelNo=B409,8,\"\")","v":""},"1700","Screen Width",{"$f":"Frame_Width-3.3125","v":-3.3125}]
[{"$f":"IF(ModelNo=B410,9,\"\")","v":""},"1700","Screen Height",{"$f":"TRUNC((CDIM_1700-1.4375)*32+0.5)/32","v":-1.40625}]
[{"$f":"IF(ModelNo=B411,10,\"\")","v":""},"1700","Bottom Sash Weight",{"$f":"IF(ISERROR(BTM_WGT&\" \"&\"lb\"),\"N/A\",BTM_WGT&\" \"&\"lb\")","v":"0 lb"}]
[{"$f":"IF(ModelNo=B412,11,\"\")","v":""},"1700","Balance Size",{"$f":"IF(BOTT_BT=0,\"N/A\",BOTT_BT)","v":"N/A"}]
[{"$f":"IF(ModelNo=B413,12,\"\")","v":""},"1700","Egress Opening Width",{"$f":"IF(ISERROR(EW),\"N/A\",EW)","v":0}]
[{"$f":"IF(ModelNo=B414,13,\"\")","v":""},"1700","Egress Opening Height",{"$f":"IF(ISERROR(EH),\"N/A\",EH)","v":0}]
[{"$f":"IF(ModelNo=B415,14,\"\")","v":""},"1700","Egress Opening Area (sq.ft.)",{"$f":"(D413*D414)/144","v":0}]
[{"$f":"IF(ModelNo=B416,1,\"\")","v":""},"1702","Sash Width",{"$f":"CDIM_1702-0.78125","v":-0.78125}]
[{"$f":"IF(ModelNo=B417,2,\"\")","v":""},"1702","Sash Height",{"$f":"Frame_Height-2.1875","v":-2.1875}]
[{"$f":"IF(ModelNo=B418,3,\"\")","v":""},"1702","Sash Glass Width",{"$f":"D416-1.375","v":-2.15625}]
[{"$f":"IF(ModelNo=B419,4,\"\")","v":""},"1702","Sash Glass Height",{"$f":"D417-1.3125","v":-3.5}]
[{"$f":"IF(ModelNo=B420,5,\"\")","v":""},"1702","Fixed Glass Width",{"$f":"TRUNC((DDIM_1702-2.09375)*32+0.5)/32","v":-2.0625}]
[{"$f":"IF(ModelNo=B421,6,\"\")","v":""},"1702","Fixed Glass Height",{"$f":"Frame_Height-3.5","v":-3.5}]
[{"$f":"IF(ModelNo=B422,7,\"\")","v":""},"1702","Astragal Length",{"$f":"TRUNC((Frame_Height-2.875)*16+0.5)/16","v":-2.8125}]
[{"$f":"IF(ModelNo=B423,8,\"\")","v":""},"1702","Roller Track Length",{"$f":"TRUNC((Frame_Width-1)*16+0.5)/16","v":-0.9375}]
[{"$f":"IF(ModelNo=B424,9,\"\")","v":""},"1702","Screen Width",{"$f":"TRUNC((CDIM_1702-2.4375)*32+0.5)/32","v":-2.40625}]
[{"$f":"IF(ModelNo=B425,10,\"\")","v":""},"1702","Screen Height",{"$f":"TRUNC((Frame_Height-3.375)*16+0.5)/16","v":-3.3125}]
[{"$f":"IF(ModelNo=B426,11,\"\")","v":""},"1702","Egress Opening Width",{"$f":"CDIM_1702-3.625","v":-3.625}]
[{"$f":"IF(ModelNo=B427,12,\"\")","v":""},"1702","Egress Opening Height",{"$f":"Frame_Height-4.5","v":-4.5}]
[{"$f":"IF(ModelNo=B428,13,\"\")","v":""},"1702","Egress Opening Area (sq.ft.)",{"$f":"(D426*D427)/144","v":0.11328125}]
[{"$f":"IF(ModelNo=B429,1,\"\")","v":""},"1703","Sash Width",{"$f":"(Frame_Width/4)-0.0625","v":-6.25E-2}]
[{"$f":"IF(ModelNo=B430,2,\"\")","v":""},"1703","Sash Height",{"$f":"Frame_Height-2.1875","v":-2.1875}]
[{"$f":"IF(ModelNo=B431,3,\"\")","v":""},"1703","Sash Glass Width",{"$f":"D429-1.375","v":-1.4375}]
[{"$f":"IF(ModelNo=B432,4,\"\")","v":""},"1703","Sash Glass Height",{"$f":"D430-1.3125","v":-3.5}]
[{"$f":"IF(ModelNo=B433,5,\"\")","v":""},"1703","Fixed Glass Width",{"$f":"(Frame_Width/2)-2.09375","v":-2.09375}]
[{"$f":"IF(ModelNo=B434,6,\"\")","v":""},"1703","Fixed Glass Height",{"$f":"Frame_Height-3.5","v":-3.5}]
[{"$f":"IF(ModelNo=B435,7,\"\")","v":""},"1703","Astragal Length",{"$f":"TRUNC((Frame_Height-2.875)*16+0.5)/16","v":-2.8125}]
[{"$f":"IF(ModelNo=B436,8,\"\")","v":""},"1703","Roller Track Length",{"$f":"TRUNC((Frame_Width-1)*16+0.5)/16","v":-0.9375}]
[{"$f":"IF(ModelNo=B437,9,\"\")","v":""},"1703","Screen Width",{"$f":"TRUNC((Frame_Width/4-1.75)*16+0.5)/16","v":-1.6875}]
[{"$f":"IF(ModelNo=B438,10,\"\")","v":""},"1703","Screen Height",{"$f":"TRUNC((Frame_Height-3.375)*16+0.5)/16","v":-3.3125}]
[{"$f":"IF(ModelNo=B439,11,\"\")","v":""},"1703","Egress Opening Width",{"$f":"(Frame_Width/4)-3.25","v":-3.25}]
[{"$f":"IF(ModelNo=B440,12,\"\")","v":""},"1703","Egress Opening Height",{"$f":"Frame_Height-4.5","v":-4.5}]
[{"$f":"IF(ModelNo=B441,13,\"\")","v":""},"1703","Egress Opening Area (sq.ft.)",{"$f":"(D439*D440)/144","v":0.1015625}]
[{"$f":"IF(ModelNo=B442,14,\"\")","v":""},"1703","Center of Meeting Rail from Edge of Frame",{"$f":"(Frame_Width/4)+0.625","v":0.625}]
[{"$f":"IF(ModelNo=B443,1,\"\")","v":""},"1709","Sash Width",{"$f":"TRUNC((Frame_Width/3-0.375)*16+0.5)/16","v":-0.3125}]
[{"$f":"IF(ModelNo=B444,2,\"\")","v":""},"1709","Sash Height",{"$f":"Frame_Height-2.1875","v":-2.1875}]
[{"$f":"IF(ModelNo=B445,3,\"\")","v":""},"1709","Sash Glass Width",{"$f":"D443-1.375","v":-1.6875}]
[{"$f":"IF(ModelNo=B446,4,\"\")","v":""},"1709","Sash Glass Height",{"$f":"D444-1.3125","v":-3.5}]
[{"$f":"IF(ModelNo=B447,5,\"\")","v":""},"1709","Fixed Glass Width",{"$f":"TRUNC((Frame_Width/3-1.6875)*16+0.5)/16","v":-1.625}]
[{"$f":"IF(ModelNo=B448,6,\"\")","v":""},"1709","Fixed Glass Height",{"$f":"TRUNC((Frame_Height-3.5)*16+0.5)/16","v":-3.4375}]
[{"$f":"IF(ModelNo=B449,7,\"\")","v":""},"1709","Astragal Length",{"$f":"Frame_Height-2.875","v":-2.875}]
[{"$f":"IF(ModelNo=B450,8,\"\")","v":""},"1709","Roller Track Length",{"$f":"TRUNC((Frame_Width-1)*16+0.5)/16","v":-0.9375}]
[{"$f":"IF(ModelNo=B451,9,\"\")","v":""},"1709","Screen Width",{"$f":"TRUNC((Frame_Width/3-1.9375)*16+0.5)/16","v":-1.875}]
[{"$f":"IF(ModelNo=B452,10,\"\")","v":""},"1709","Screen Height",{"$f":"Frame_Height-3.375","v":-3.375}]
[{"$f":"IF(ModelNo=B453,11,\"\")","v":""},"1709","Egress Opening Width",{"$f":"(Frame_Width/3)-2.875","v":-2.875}]
[{"$f":"IF(ModelNo=B454,12,\"\")","v":""},"1709","Egress Opening Height",{"$f":"Frame_Height-4.5","v":-4.5}]
[{"$f":"IF(ModelNo=B455,13,\"\")","v":""},"1709","Egress Opening Area (sq.ft.)",{"$f":"(D453*D454)/144","v":8.984375E-2}]
[{"$f":"IF(ModelNo=B456,14,\"\")","v":""},"1709","Center of Meeting Rail from Edge of Frame",{"$f":"(TRUNC((Frame_Width/3)*16+0.5)/16)+0.3125","v":0.3125}]
[{"$f":"IF(ModelNo=B457,1,\"\")","v":""},"1704","Glass Width",{"$f":"Frame_Width-3.5","v":-3.5}]
[{"$f":"IF(ModelNo=B458,2,\"\")","v":""},"1704","Glass Height",{"$f":"Frame_Height-3.5","v":-3.5}]
[{"$f":"IF(ModelNo=B459,3,\"\")","v":""},"1704","Glass Area (sq.ft.)",{"$f":"(D457*D458)/144","v":8.5069444444444448E-2}]
[{"$f":"IF(ModelNo=B460,1,\"\")","v":""},"1720","Bottom Sash Width",{"$f":"TRUNC((Frame_Width/2-2.4375)*32+0.5)/32","v":-2.40625}]
[{"$f":"IF(ModelNo=B461,2,\"\")","v":""},"1720","Bottom Sash Height",{"$f":"TRUNC(((CDIM_1720-0.84375)*32+0.5))/32","v":-0.8125}]
[{"$f":"IF(ModelNo=B462,3,\"\")","v":""},"1720","Bottom Glass Width",{"$f":"TRUNC((D460-1.3125)*32+0.5)/32","v":-3.6875}]
[{"$f":"IF(ModelNo=B463,4,\"\")","v":""},"1720","Bottom Glass Height",{"$f":"TRUNC((D461-1.312)*32+0.5)/32","v":-2.09375}]
[{"$f":"IF(ModelNo=B464,5,\"\")","v":""},"1720","Top Glass Width",{"$f":"TRUNC((Frame_Width/2-3.75)*32+0.5)/32","v":-3.71875}]
[{"$f":"IF(ModelNo=B465,6,\"\")","v":""},"1720","Top Glass Height",{"$f":"TRUNC((DDIM_1720-2.15625)*32+0.5)/32","v":-2.125}]
[{"$f":"IF(ModelNo=B466,7,\"\")","v":""},"1720","Astragal Length",{"$f":"TRUNC((Frame_Width/2-3.125)*16+0.5)/16","v":-3.0625}]
[{"$f":"IF(ModelNo=B467,8,\"\")","v":""},"1720","Screen Width",{"$f":"Frame_Width/2-3.5625","v":-3.5625}]
[{"$f":"IF(ModelNo=B468,9,\"\")","v":""},"1720","Screen Height",{"$f":"TRUNC((CDIM_1720-1.4375)*32+0.5)/32","v":-1.40625}]
[{"$f":"IF(ModelNo=B469,10,\"\")","v":""},"1720","Bottom Sash Weight",{"$f":"IF(ISERROR(BTM_WGT&\" \"&\"lb\"),\"N/A\",BTM_WGT&\" \"&\"lb\")","v":"0 lb"}]
[{"$f":"IF(ModelNo=B470,11,\"\")","v":""},"1720","Balance Size",{"$f":"IF(BOTT_BT=0,\"N/A\",BOTT_BT)","v":"N/A"}]
[{"$f":"IF(ModelNo=B471,12,\"\")","v":""},"1720","Egress Opening Width",{"$f":"IF(ISERROR(EW),\"N/A\",EW)","v":0}]
[{"$f":"IF(ModelNo=B472,13,\"\")","v":""},"1720","Egress Opening Height",{"$f":"IF(ISERROR(EH),\"N/A\",EH)","v":0}]
[{"$f":"IF(ModelNo=B473,14,\"\")","v":""},"1720","Egress Opening Area (sq.ft.)",{"$f":"(D471*D472)/144","v":0}]
[{"$f":"IF(ModelNo=B474,1,\"\")","v":""},"1730","Bottom Sash Width",{"$f":"TRUNC((Frame_Width/3-2.53125)*32+0.5)/32","v":-2.5}]
[{"$f":"IF(ModelNo=B475,2,\"\")","v":""},"1730","Bottom Sash Height",{"$f":"TRUNC(((CDIM_1730-0.84375)*32+0.5))/32","v":-0.8125}]
[{"$f":"IF(ModelNo=B476,3,\"\")","v":""},"1730","Bottom Glass Width",{"$f":"TRUNC((D474-1.34375)*32+0.5)/32","v":-3.8125}]
[{"$f":"IF(ModelNo=B477,4,\"\")","v":""},"1730","Bottom Glass Height",{"$f":"TRUNC((D475-1.3125)*32+0.5)/32","v":-2.09375}]
[{"$f":"IF(ModelNo=B478,5,\"\")","v":""},"1730","Top Glass Width",{"$f":"TRUNC((Frame_Width/3-3.84375)*32+0.5)/32","v":-3.8125}]
[{"$f":"IF(ModelNo=B479,6,\"\")","v":""},"1730","Top Glass Height",{"$f":"TRUNC((DDIM_1730-2.15625)*32+0.5)/32","v":-2.125}]
[{"$f":"IF(ModelNo=B480,7,\"\")","v":""},"1730","Astragal Length",{"$f":"TRUNC((Frame_Width/3-3.25)*16+0.5)/16","v":-3.1875}]
[{"$f":"IF(ModelNo=B481,8,\"\")","v":""},"1730","Screen Width",{"$f":"TRUNC((Frame_Width/3-3.6875)*32+0.5)/32","v":-3.65625}]
[{"$f":"IF(ModelNo=B482,9,\"\")","v":""},"1730","Screen Height",{"$f":"TRUNC((CDIM_1730-1.4375)*32+0.5)/32","v":-1.40625}]
[{"$f":"IF(ModelNo=B483,10,\"\")","v":""},"1730","Bottom Sash Weight",{"$f":"IF(ISERROR(BTM_WGT&\" \"&\"lb\"),\"N/A\",BTM_WGT&\" \"&\"lb\")","v":"0 lb"}]
[{"$f":"IF(ModelNo=B484,11,\"\")","v":""},"1730","Balance Size",{"$f":"IF(BOTT_BT=0,\"N/A\",BOTT_BT)","v":"N/A"}]
[{"$f":"IF(ModelNo=B485,12,\"\")","v":""},"1730","Egress Opening Width",{"$f":"IF(ISERROR(EW),\"N/A\",EW)","v":0}]
[{"$f":"IF(ModelNo=B486,13,\"\")","v":""},"1730","Egress Opening Height",{"$f":"IF(ISERROR(EH),\"N/A\",EH)","v":0}]
[{"$f":"IF(ModelNo=B487,14,\"\")","v":""},"1730","Egress Opening Area (sq.ft.)",{"$f":"(D485*D486)/144","v":0}]
[{"$f":"IF(ModelNo=B488,15,\"\")","v":""},"1730","Mull Location From Edge of Frame",{"$f":"TRUNC((Frame_Width/3)*16+0.5)/16","v":0}]
[{"$f":"IF(ModelNo=B489,1,\"\")","v":""},"1900","Bottom Sash Width",{"$f":"TRUNC((Frame_Width-2.1875)*32+0.5)/32","v":-2.15625}]
[{"$f":"IF(ModelNo=B490,2,\"\")","v":""},"1900","Bottom Sash Height",{"$f":"TRUNC(((CDIM_1900-0.844)*16+0.5))/16","v":-0.8125}]
[{"$f":"IF(ModelNo=B491,3,\"\")","v":""},"1900","Bottom Glass Width",{"$f":"TRUNC((D489-1.3125)*32+0.5)/32","v":-3.4375}]
[{"$f":"IF(ModelNo=B492,4,\"\")","v":""},"1900","Bottom Glass Height",{"$f":"TRUNC((D490-1.3125)*32+0.5)/32","v":-2.09375}]
[{"$f":"IF(ModelNo=B493,5,\"\")","v":""},"1900","Top Glass Width",{"$f":"TRUNC((Frame_Width-3.5)*32+0.5)/32","v":-3.46875}]
[{"$f":"IF(ModelNo=B494,6,\"\")","v":""},"1900","Top Glass Height",{"$f":"TRUNC((DDIM_1900-2.157)*32+0.5)/32","v":-2.125}]
[{"$f":"IF(ModelNo=B495,7,\"\")","v":""},"1900","Astragal Length",{"$f":"Frame_Width-2.875","v":-2.875}]
[{"$f":"IF(ModelNo=B496,8,\"\")","v":""},"1900","Screen Width",{"$f":"Frame_Width-3.3125","v":-3.3125}]
[{"$f":"IF(ModelNo=B497,9,\"\")","v":""},"1900","Screen Height",{"$f":"TRUNC((CDIM_1900-1.625)*16+0.5)/16","v":-1.5625}]
[{"$f":"IF(ModelNo=B498,10,\"\")","v":""},"1900","Bottom Sash Weight",{"$f":"IF(ISERROR(BTM_WGT&\" \"&\"lb\"),\"N/A\",BTM_WGT&\" \"&\"lb\")","v":"0 lb"}]
[{"$f":"IF(ModelNo=B499,11,\"\")","v":""},"1900","Balance Size",{"$f":"IF(BOTT_BT=0,\"N/A\",BOTT_BT)","v":"N/A"}]
[{"$f":"IF(ModelNo=B500,12,\"\")","v":""},"1900","Egress Opening Width",{"$f":"IF(ISERROR(EW),\"N/A\",EW)","v":0}]
[{"$f":"IF(ModelNo=B501,13,\"\")","v":""},"1900","Egress Opening Height",{"$f":"IF(ISERROR(EH),\"N/A\",EH)","v":0}]
[{"$f":"IF(ModelNo=B502,14,\"\")","v":""},"1900","Egress Opening Area (sq.ft.)",{"$f":"(D500*D501)/144","v":0}]
[{"$f":"IF(ModelNo=B503,1,\"\")","v":""},"1902","Sash Width",{"$f":"CDIM_1902-0.6875","v":-0.6875}]
[{"$f":"IF(ModelNo=B504,2,\"\")","v":""},"1902","Sash Height",{"$f":"Frame_Height-2.1875","v":-2.1875}]
[{"$f":"IF(ModelNo=B505,3,\"\")","v":""},"1902","Sash Glass Width",{"$f":"D503-1.375","v":-2.0625}]
[{"$f":"IF(ModelNo=B506,4,\"\")","v":""},"1902","Sash Glass Height",{"$f":"D504-1.3125","v":-3.5}]
[{"$f":"IF(ModelNo=B507,5,\"\")","v":""},"1902","Fixed Glass Width",{"$f":"DDIM_1902-2.0625","v":-2.0625}]
[{"$f":"IF(ModelNo=B508,6,\"\")","v":""},"1902","Fixed Glass Height",{"$f":"Frame_Height-3.5","v":-3.5}]
[{"$f":"IF(ModelNo=B509,7,\"\")","v":""},"1902","Astragal Length",{"$f":"Frame_Height-2.875","v":-2.875}]
[{"$f":"IF(ModelNo=B510,8,\"\")","v":""},"1902","Roller Track Length",{"$f":"Frame_Width-0.75","v":-0.75}]
[{"$f":"IF(ModelNo=B511,9,\"\")","v":""},"1902","Screen Width",{"$f":"TRUNC((CDIM_1902-2.5625)*16+0.5)/16","v":-2.5}]
[{"$f":"IF(ModelNo=B512,10,\"\")","v":""},"1902","Screen Height",{"$f":"TRUNC((Frame_Height-3.375)*16+0.5)/16","v":-3.3125}]
[{"$f":"IF(ModelNo=B513,11,\"\")","v":""},"1902","Egress Opening Width",{"$f":"CDIM_1902-3.75","v":-3.75}]
[{"$f":"IF(ModelNo=B514,12,\"\")","v":""},"1902","Egress Opening Height",{"$f":"Frame_Height-4.5","v":-4.5}]
[{"$f":"IF(ModelNo=B515,13,\"\")","v":""},"1902","Egress Opening Area (sq.ft.)",{"$f":"(D513*D514)/144","v":0.1171875}]
[{"$f":"IF(ModelNo=B516,1,\"\")","v":""},"1903","Sash Width",{"$f":"TRUNC((Frame_Width/4+0.219)*16+0.5)/16","v":0.25}]
[{"$f":"IF(ModelNo=B517,2,\"\")","v":""},"1903","Sash Height",{"$f":"TRUNC((Frame_Height-2.1875)*16+0.5)/16","v":-2.125}]
[{"$f":"IF(ModelNo=B518,3,\"\")","v":""},"1903","Sash Glass Width",{"$f":"TRUNC((D516-1.3125)*16+0.5)/16","v":-1}]
[{"$f":"IF(ModelNo=B519,4,\"\")","v":""},"1903","Sash Glass Height",{"$f":"D517-1.3125","v":-3.4375}]
[{"$f":"IF(ModelNo=B520,5,\"\")","v":""},"1903","Fixed Glass Width",{"$f":"TRUNC((Frame_Width/2-2.219)*16+0.5)/16","v":-2.1875}]
[{"$f":"IF(ModelNo=B521,6,\"\")","v":""},"1903","Fixed Glass Height",{"$f":"TRUNC((Frame_Height-3.5)*16+0.5)/16","v":-3.4375}]
[{"$f":"IF(ModelNo=B522,7,\"\")","v":""},"1903","Astragal Length",{"$f":"Frame_Height-2.875","v":-2.875}]
[{"$f":"IF(ModelNo=B523,8,\"\")","v":""},"1903","Roller Track Length",{"$f":"Frame_Width-0.75","v":-0.75}]
[{"$f":"IF(ModelNo=B524,9,\"\")","v":""},"1903","Screen Width",{"$f":"TRUNC((Frame_Width/4-1.6875)*16+0.5)/16","v":-1.625}]
[{"$f":"IF(ModelNo=B525,10,\"\")","v":""},"1903","Screen Height",{"$f":"Frame_Height-3.375","v":-3.375}]
[{"$f":"IF(ModelNo=B526,11,\"\")","v":""},"1903","Egress Opening Width",{"$f":"(Frame_Width/4)-3.25","v":-3.25}]
[{"$f":"IF(ModelNo=B527,12,\"\")","v":""},"1903","Egress Opening Height",{"$f":"Frame_Height-4.5","v":-4.5}]
[{"$f":"IF(ModelNo=B528,13,\"\")","v":""},"1903","Egress Opening Area (sq.ft.)",{"$f":"(D526*D527)/144","v":0.1015625}]
[{"$f":"IF(ModelNo=B529,14,\"\")","v":""},"1903","Center of Meeting Rail from Edge of Frame",{"$f":"(Frame_Width/4)+0.75","v":0.75}]
[{"$f":"IF(ModelNo=B530,1,\"\")","v":""},"1909","Sash Width",{"$f":"TRUNC((Frame_Width/3-0.188)*16+0.5)/16","v":-0.125}]
[{"$f":"IF(ModelNo=B531,2,\"\")","v":""},"1909","Sash Height",{"$f":"TRUNC((Frame_Height-2.1875)*16+0.5)/16","v":-2.125}]
[{"$f":"IF(ModelNo=B532,3,\"\")","v":""},"1909","Sash Glass Width",{"$f":"TRUNC((Frame_Width/3-1.5)*16+0.5)/16","v":-1.4375}]
[{"$f":"IF(ModelNo=B533,4,\"\")","v":""},"1909","Sash Glass Height",{"$f":"D531-1.3125","v":-3.4375}]
[{"$f":"IF(ModelNo=B534,5,\"\")","v":""},"1909","Fixed Glass Width",{"$f":"TRUNC((Frame_Width/3-1.5)*16+0.5)/16","v":-1.4375}]
[{"$f":"IF(ModelNo=B535,6,\"\")","v":""},"1909","Fixed Glass Height",{"$f":"TRUNC((Frame_Height-3.5)*16+0.5)/16","v":-3.4375}]
[{"$f":"IF(ModelNo=B536,7,\"\")","v":""},"1909","Astragal Length",{"$f":"Frame_Height-2.875","v":-2.875}]
[{"$f":"IF(ModelNo=B537,8,\"\")","v":""},"1909","Roller Track Length",{"$f":"Frame_Width-0.75","v":-0.75}]
[{"$f":"IF(ModelNo=B538,9,\"\")","v":""},"1909","Screen Width",{"$f":"TRUNC((Frame_Width/3-2.0625)*16+0.5)/16","v":-2}]
[{"$f":"IF(ModelNo=B539,10,\"\")","v":""},"1909","Screen Height",{"$f":"Frame_Height-3.375","v":-3.375}]
[{"$f":"IF(ModelNo=B540,11,\"\")","v":""},"1909","Egress Opening Width",{"$f":"(Frame_Width/3)-2.875","v":-2.875}]
[{"$f":"IF(ModelNo=B541,12,\"\")","v":""},"1909","Egress Opening Height",{"$f":"Frame_Height-4.5","v":-4.5}]
[{"$f":"IF(ModelNo=B542,13,\"\")","v":""},"1909","Egress Opening Area (sq.ft.)",{"$f":"(D540*D541)/144","v":8.984375E-2}]
[{"$f":"IF(ModelNo=B543,14,\"\")","v":""},"1909","Center of Meeting Rail from Edge of Frame",{"$f":"(TRUNC((Frame_Width/3)*16+0.5)/16)+0.375","v":0.375}]
[{"$f":"IF(ModelNo=B544,1,\"\")","v":""},"1904","Glass Width",{"$f":"Frame_Width-3.5","v":-3.5}]
[{"$f":"IF(ModelNo=B545,2,\"\")","v":""},"1904","Glass Height",{"$f":"Frame_Height-3.5","v":-3.5}]
[{"$f":"IF(ModelNo=B546,3,\"\")","v":""},"1904","Glass Area (sq.ft.)",{"$f":"(D544*D545)/144","v":8.5069444444444448E-2}]
[{"$f":"IF(ModelNo=B547,1,\"\")","v":""},"1920","Bottom Sash Width",{"$f":"TRUNC((Frame_Width/2-2.4375)*32+0.5)/32","v":-2.40625}]
[{"$f":"IF(ModelNo=B548,2,\"\")","v":""},"1920","Bottom Sash Height",{"$f":"TRUNC(((CDIM_1920-0.8441)*16+0.5))/16","v":-0.8125}]
[{"$f":"IF(ModelNo=B549,3,\"\")","v":""},"1920","Bottom Glass Width",{"$f":"TRUNC((D547-1.3125)*32+0.5)/32","v":-3.6875}]
[{"$f":"IF(ModelNo=B550,4,\"\")","v":""},"1920","Bottom Glass Height",{"$f":"TRUNC((D548-1.3125)*32+0.5)/32","v":-2.09375}]
[{"$f":"IF(ModelNo=B551,5,\"\")","v":""},"1920","Top Glass Width",{"$f":"TRUNC((Frame_Width/2-3.75)*32+0.5)/32","v":-3.71875}]
[{"$f":"IF(ModelNo=B552,6,\"\")","v":""},"1920","Top Glass Height",{"$f":"TRUNC((DDIM_1920-2.156)*32+0.5)/32","v":-2.125}]
[{"$f":"IF(ModelNo=B553,7,\"\")","v":""},"1920","Astragal Length",{"$f":"Frame_Width/2-3.125","v":-3.125}]
[{"$f":"IF(ModelNo=B554,8,\"\")","v":""},"1920","Screen Width",{"$f":"Frame_Width/2-3.5625","v":-3.5625}]
[{"$f":"IF(ModelNo=B555,9,\"\")","v":""},"1920","Screen Height",{"$f":"TRUNC((CDIM_1920-1.625)*16+0.5)/16","v":-1.5625}]
[{"$f":"IF(ModelNo=B556,10,\"\")","v":""},"1920","Bottom Sash Weight",{"$f":"IF(ISERROR(BTM_WGT&\" \"&\"lb\"),\"N/A\",BTM_WGT&\" \"&\"lb\")","v":"0 lb"}]
[{"$f":"IF(ModelNo=B557,11,\"\")","v":""},"1920","Balance Size",{"$f":"IF(BOTT_BT=0,\"N/A\",BOTT_BT)","v":"N/A"}]
[{"$f":"IF(ModelNo=B558,12,\"\")","v":""},"1920","Egress Opening Width",{"$f":"IF(ISERROR(EW),\"N/A\",EW)","v":0}]
[{"$f":"IF(ModelNo=B559,13,\"\")","v":""},"1920","Egress Opening Height",{"$f":"IF(ISERROR(EH),\"N/A\",EH)","v":0}]
[{"$f":"IF(ModelNo=B560,14,\"\")","v":""},"1920","Egress Opening Area (sq.ft.)",{"$f":"(D558*D559)/144","v":0}]
[{"$f":"IF(ModelNo=B561,1,\"\")","v":""},"1930","Bottom Sash Width",{"$f":"TRUNC((Frame_Width/3-2.53125)*32+0.5)/32","v":-2.5}]
[{"$f":"IF(ModelNo=B562,2,\"\")","v":""},"1930","Bottom Sash Height",{"$f":"TRUNC(((CDIM_1930-0.8441)*16+0.5))/16","v":-0.8125}]
[{"$f":"IF(ModelNo=B563,3,\"\")","v":""},"1930","Bottom Glass Width",{"$f":"TRUNC((D561-1.3125)*32+0.5)/32","v":-3.78125}]
[{"$f":"IF(ModelNo=B564,4,\"\")","v":""},"1930","Bottom Glass Height",{"$f":"TRUNC((D562-1.3125)*32+0.5)/32","v":-2.09375}]
[{"$f":"IF(ModelNo=B565,5,\"\")","v":""},"1930","Top Glass Width",{"$f":"TRUNC((Frame_Width/3-3.844)*32+0.5)/32","v":-3.8125}]
[{"$f":"IF(ModelNo=B566,6,\"\")","v":""},"1930","Top Glass Height",{"$f":"TRUNC((DDIM_1930-2.156)*32+0.5)/32","v":-2.125}]
[{"$f":"IF(ModelNo=B567,7,\"\")","v":""},"1930","Astragal Length",{"$f":"TRUNC((Frame_Width/3-3.219)*16+0.5)/16","v":-3.1875}]
[{"$f":"IF(ModelNo=B568,8,\"\")","v":""},"1930","Screen Width",{"$f":"TRUNC((Frame_Width/3-3.6875)*16+0.5)/16","v":-3.625}]
[{"$f":"IF(ModelNo=B569,9,\"\")","v":""},"1930","Screen Height",{"$f":"TRUNC((CDIM_1930-1.625)*16+0.5)/16","v":-1.5625}]
[{"$f":"IF(ModelNo=B570,10,\"\")","v":""},"1930","Bottom Sash Weight",{"$f":"IF(ISERROR(BTM_WGT&\" \"&\"lb\"),\"N/A\",BTM_WGT&\" \"&\"lb\")","v":"0 lb"}]
[{"$f":"IF(ModelNo=B571,11,\"\")","v":""},"1930","Balance Size",{"$f":"IF(BOTT_BT=0,\"N/A\",BOTT_BT)","v":"N/A"}]
[{"$f":"IF(ModelNo=B572,12,\"\")","v":""},"1930","Egress Opening Width",{"$f":"IF(ISERROR(EW),\"N/A\",EW)","v":0}]
[{"$f":"IF(ModelNo=B573,13,\"\")","v":""},"1930","Egress Opening Height",{"$f":"IF(ISERROR(EH),\"N/A\",EH)","v":0}]
[{"$f":"IF(ModelNo=B574,14,\"\")","v":""},"1930","Egress Opening Area (sq.ft.)",{"$f":"(D572*D573)/144","v":0}]
[{"$f":"IF(ModelNo=B575,15,\"\")","v":""},"1930","Mull Location From Edge of Frame",{"$f":"(TRUNC((Frame_Width/3)*16+0.5)/16)","v":0}]
[{"$f":"IF(ModelNo=B576,1,\"\")","v":""},"1901","Top Sash Width",{"$f":"Frame_Width-3.4375","v":-3.4375}]
[{"$f":"IF(ModelNo=B577,2,\"\")","v":""},"1901","Top Sash Height",{"$f":"DDIM_1901-0.90625","v":-0.90625}]
[{"$f":"IF(ModelNo=B578,3,\"\")","v":""},"1901","Bottom Sash Width",{"$f":"Frame_Width-2.1875","v":-2.1875}]
[{"$f":"IF(ModelNo=B579,4,\"\")","v":""},"1901","Bottom Sash Height",{"$f":"CDIM_1901-0.90625","v":-0.90625}]
[{"$f":"IF(ModelNo=B580,5,\"\")","v":""},"1901","Top Glass Width",{"$f":"D576-1.3125","v":-4.75}]
[{"$f":"IF(ModelNo=B581,6,\"\")","v":""},"1901","Top Glass Height",{"$f":"D577-1.3125","v":-2.21875}]
[{"$f":"IF(ModelNo=B582,7,\"\")","v":""},"1901","Bottom Glass Width",{"$f":"D578-1.3125","v":-3.5}]
[{"$f":"IF(ModelNo=B583,8,\"\")","v":""},"1901","Bottom Glass Height",{"$f":"D579-1.3125","v":-2.21875}]
[{"$f":"IF(ModelNo=B584,9,\"\")","v":""},"1901","Screen Width",{"$f":"Frame_Width-3.875","v":-3.875}]
[{"$f":"IF(ModelNo=B585,10,\"\")","v":""},"1901","Screen Height",{"$f":"IF(Screen=\"F\",Frame_Height-3,CDIM_1901-1.0625)","v":-1.0625}]
[{"$f":"IF(ModelNo=B586,11,\"\")","v":""},"1901","Top Sash Weight (Plus 3 lb)",{"$f":"IF(ISERROR(TOP_WGT&\" \"&\"lb\"),\"N/A\",TOP_WGT&\" \"&\"lb\")","v":"0 lb"}]
[{"$f":"IF(ModelNo=B587,12,\"\")","v":""},"1901","Top Balance Size",{"$f":"IF(TOP_BT=0,\"N/A\",TOP_BT)","v":"N/A"}]
[{"$f":"IF(ModelNo=B588,13,\"\")","v":""},"1901","Bottom Sash Weight",{"$f":"IF(ISERROR(BTM_WGT&\" \"&\"lb\"),\"N/A\",BTM_WGT&\" \"&\"lb\")","v":"0 lb"}]
[{"$f":"IF(ModelNo=B589,14,\"\")","v":""},"1901","Bottom Balance Size",{"$f":"IF(BOTT_BT=0,\"N/A\",BOTT_BT)","v":"N/A"}]
[{"$f":"IF(ModelNo=B590,15,\"\")","v":""},"1901","Egress Opening Width",{"$f":"IF(ISERROR(EW),\"N/A\",EW)","v":0}]
[{"$f":"IF(ModelNo=B591,16,\"\")","v":""},"1901","Egress Opening Height",{"$f":"IF(ISERROR(EH),\"N/A\",EH)","v":0}]
[{"$f":"IF(ModelNo=B592,17,\"\")","v":""},"1901","Egress Opening Area (sq.ft.)",{"$f":"(D590*D591)/144","v":0}]
[{"$f":"IF(ModelNo=B593,1,\"\")","v":""},"1921","Top Sash Width",{"$f":"Frame_Width/2-3.6875","v":-3.6875}]
[{"$f":"IF(ModelNo=B594,2,\"\")","v":""},"1921","Top Sash Height",{"$f":"DDIM_1921-0.90625","v":-0.90625}]
[{"$f":"IF(ModelNo=B595,3,\"\")","v":""},"1921","Bottom Sash Width",{"$f":"Frame_Width/2-2.4375","v":-2.4375}]
[{"$f":"IF(ModelNo=B596,4,\"\")","v":""},"1921","Bottom Sash Height",{"$f":"CDIM_1921-0.90625","v":-0.90625}]
[{"$f":"IF(ModelNo=B597,5,\"\")","v":""},"1921","Top Glass Width",{"$f":"D593-1.3125","v":-5}]
[{"$f":"IF(ModelNo=B598,6,\"\")","v":""},"1921","Top Glass Height",{"$f":"D594-1.3125","v":-2.21875}]
[{"$f":"IF(ModelNo=B599,7,\"\")","v":""},"1921","Bottom Glass Width",{"$f":"D595-1.3125","v":-3.75}]
[{"$f":"IF(ModelNo=B600,8,\"\")","v":""},"1921","Bottom Glass Height",{"$f":"D596-1.3125","v":-2.21875}]
[{"$f":"IF(ModelNo=B601,9,\"\")","v":""},"1921","Screen Width",{"$f":"Frame_Width/2-4.125","v":-4.125}]
[{"$f":"IF(ModelNo=B602,10,\"\")","v":""},"1921","Screen Height",{"$f":"IF(Screen=\"F\",Frame_Height-3,CDIM_1901-1.0625)","v":-1.0625}]
[{"$f":"IF(ModelNo=B603,11,\"\")","v":""},"1921","Top Sash Weight (Plus 3 lb)",{"$f":"IF(ISERROR(TOP_WGT&\" \"&\"lb\"),\"N/A\",TOP_WGT&\" \"&\"lb\")","v":"0 lb"}]
[{"$f":"IF(ModelNo=B604,12,\"\")","v":""},"1921","Top Balance Size",{"$f":"IF(TOP_BT=0,\"N/A\",TOP_BT)","v":"N/A"}]
[{"$f":"IF(ModelNo=B605,13,\"\")","v":""},"1921","Bottom Sash Weight",{"$f":"IF(ISERROR(BTM_WGT&\" \"&\"lb\"),\"N/A\",BTM_WGT&\" \"&\"lb\")","v":"0 lb"}]
[{"$f":"IF(ModelNo=B606,14,\"\")","v":""},"1921","Bottom Balance Size",{"$f":"IF(BOTT_BT=0,\"N/A\",BOTT_BT)","v":"N/A"}]
[{"$f":"IF(ModelNo=B607,15,\"\")","v":""},"1921","Egress Opening Width",{"$f":"IF(ISERROR(EW),\"N/A\",EW)","v":0}]
[{"$f":"IF(ModelNo=B608,16,\"\")","v":""},"1921","Egress Opening Height",{"$f":"IF(ISERROR(EH),\"N/A\",EH)","v":0}]
[{"$f":"IF(ModelNo=B609,17,\"\")","v":""},"1921","Egress Opening Area (sq.ft.)",{"$f":"(D607*D608)/144","v":0}]
[{"$f":"IF(ModelNo=B610,1,\"\")","v":""},"1931","Top Sash Width",{"$f":"Frame_Width/3-3.75","v":-3.75}]
[{"$f":"IF(ModelNo=B611,2,\"\")","v":""},"1931","Top Sash Height",{"$f":"DDIM_1901-0.90625","v":-0.90625}]
[{"$f":"IF(ModelNo=B612,3,\"\")","v":""},"1931","Bottom Sash Width",{"$f":"Frame_Width/3-2.5","v":-2.5}]
[{"$f":"IF(ModelNo=B613,4,\"\")","v":""},"1931","Bottom Sash Height",{"$f":"CDIM_1901-0.90625","v":-0.90625}]
[{"$f":"IF(ModelNo=B614,5,\"\")","v":""},"1931","Top Glass Width",{"$f":"D610-1.3125","v":-5.0625}]
[{"$f":"IF(ModelNo=B615,6,\"\")","v":""},"1931","Top Glass Height",{"$f":"D611-1.3125","v":-2.21875}]
[{"$f":"IF(ModelNo=B616,7,\"\")","v":""},"1931","Bottom Glass Width",{"$f":"D612-1.3125","v":-3.8125}]
[{"$f":"IF(ModelNo=B617,8,\"\")","v":""},"1931","Bottom Glass Height",{"$f":"D613-1.3125","v":-2.21875}]
[{"$f":"IF(ModelNo=B618,9,\"\")","v":""},"1931","Screen Width",{"$f":"Frame_Width/3-4.1875","v":-4.1875}]
[{"$f":"IF(ModelNo=B619,10,\"\")","v":""},"1931","Screen Height",{"$f":"IF(Screen=\"F\",Frame_Height-3,CDIM_1901-1.0625)","v":-1.0625}]
[{"$f":"IF(ModelNo=B620,11,\"\")","v":""},"1931","Top Sash Weight (Plus 3 lb)",{"$f":"IF(ISERROR(TOP_WGT&\" \"&\"lb\"),\"N/A\",TOP_WGT&\" \"&\"lb\")","v":"0 lb"}]
[{"$f":"IF(ModelNo=B621,12,\"\")","v":""},"1931","Top Balance Size",{"$f":"IF(TOP_BT=0,\"N/A\",TOP_BT)","v":"N/A"}]
[{"$f":"IF(ModelNo=B622,13,\"\")","v":""},"1931","Bottom Sash Weight",{"$f":"IF(ISERROR(BTM_WGT&\" \"&\"lb\"),\"N/A\",BTM_WGT&\" \"&\"lb\")","v":"0 lb"}]
[{"$f":"IF(ModelNo=B623,14,\"\")","v":""},"1931","Bottom Balance Size",{"$f":"IF(BOTT_BT=0,\"N/A\",BOTT_BT)","v":"N/A"}]
[{"$f":"IF(ModelNo=B624,15,\"\")","v":""},"1931","Egress Opening Width",{"$f":"IF(ISERROR(EW),\"N/A\",EW)","v":0}]
[{"$f":"IF(ModelNo=B625,16,\"\")","v":""},"1931","Egress Opening Height",{"$f":"IF(ISERROR(EH),\"N/A\",EH)","v":0}]
[{"$f":"IF(ModelNo=B626,17,\"\")","v":""},"1931","Egress Opening Area (sq.ft.)",{"$f":"(D624*D625)/144","v":0}]
[{"$f":"IF(ModelNo=B627,18,\"\")","v":""},"1931","Mull Location From Edge of Frame",{"$f":"(TRUNC((Frame_Width/3)*16+0.5)/16)","v":0}]
[{"$f":"IF(ModelNo=B628,1,\"\")","v":""},"1914","Glass Width",{"$f":"Frame_Width-3.5","v":-3.5}]
[{"$f":"IF(ModelNo=B629,2,\"\")","v":""},"1914","Glass Height",{"$f":"Frame_Height-3.5","v":-3.5}]
[{"$f":"IF(ModelNo=B630,3,\"\")","v":""},"1914","Glass Area (sq.ft.)",{"$f":"(D628*D629)/144","v":8.5069444444444448E-2}]